hadoop-mapreduce-dev mailing list archives

Site index · List index
Message view « Date » · « Thread »
Top « Date » · « Thread »
From Apache Jenkins Server <jenk...@builds.apache.org>
Subject Hadoop-Mapreduce-trunk - Build # 3161 - Still Failing
Date Wed, 06 Apr 2016 01:10:10 GMT
See https://builds.apache.org/job/Hadoop-Mapreduce-trunk/3161/

###################################################################################
########################## LAST 60 LINES OF THE CONSOLE ###########################
[...truncated 31988 lines...]
Tests run: 2, Failures: 0, Errors: 0, Skipped: 0, Time elapsed: 192.274 sec - in org.apache.hadoop.mapred.TestMiniMRWithDFSWithDistinctUsers
Running org.apache.hadoop.mapred.pipes.TestPipes
Tests run: 1, Failures: 0, Errors: 0, Skipped: 1, Time elapsed: 0.043 sec - in org.apache.hadoop.mapred.pipes.TestPipes
Running org.apache.hadoop.mapred.pipes.TestPipesNonJavaInputFormat
Tests run: 1, Failures: 0, Errors: 0, Skipped: 0, Time elapsed: 1.507 sec - in org.apache.hadoop.mapred.pipes.TestPipesNonJavaInputFormat
Running org.apache.hadoop.mapred.pipes.TestPipeApplication
Tests run: 5, Failures: 0, Errors: 0, Skipped: 0, Time elapsed: 5.855 sec - in org.apache.hadoop.mapred.pipes.TestPipeApplication
Running org.apache.hadoop.mapred.TestJavaSerialization
Tests run: 2, Failures: 0, Errors: 0, Skipped: 0, Time elapsed: 5.096 sec - in org.apache.hadoop.mapred.TestJavaSerialization
Running org.apache.hadoop.mapred.TestSpecialCharactersInOutputPath
Tests run: 1, Failures: 0, Errors: 0, Skipped: 0, Time elapsed: 23.692 sec - in org.apache.hadoop.mapred.TestSpecialCharactersInOutputPath
Running org.apache.hadoop.ipc.TestMRCJCSocketFactory
Tests run: 1, Failures: 0, Errors: 0, Skipped: 0, Time elapsed: 19.153 sec - in org.apache.hadoop.ipc.TestMRCJCSocketFactory

Results :

Failed tests: 
  TestUberAM>TestMRJobs.testJobWithChangePriority:276 expected:<DEFAULT> but was:<HIGH>
  TestMRJobs.testJobWithChangePriority:276 expected:<DEFAULT> but was:<HIGH>

Tests run: 532, Failures: 2, Errors: 0, Skipped: 11

[INFO] ------------------------------------------------------------------------
[INFO] Reactor Summary:
[INFO] 
[INFO] Apache Hadoop MapReduce Client .................... SUCCESS [  2.790 s]
[INFO] Apache Hadoop MapReduce Core ...................... SUCCESS [01:50 min]
[INFO] Apache Hadoop MapReduce Common .................... SUCCESS [ 27.878 s]
[INFO] Apache Hadoop MapReduce Shuffle ................... SUCCESS [  5.099 s]
[INFO] Apache Hadoop MapReduce App ....................... SUCCESS [09:19 min]
[INFO] Apache Hadoop MapReduce HistoryServer ............. SUCCESS [05:37 min]
[INFO] Apache Hadoop MapReduce JobClient ................. FAILURE [  01:58 h]
[INFO] Apache Hadoop MapReduce HistoryServer Plugins ..... SKIPPED
[INFO] Apache Hadoop MapReduce NativeTask ................ SKIPPED
[INFO] Apache Hadoop MapReduce Examples .................. SKIPPED
[INFO] Apache Hadoop MapReduce ........................... SKIPPED
[INFO] ------------------------------------------------------------------------
[INFO] BUILD FAILURE
[INFO] ------------------------------------------------------------------------
[INFO] Total time: 02:15 h
[INFO] Finished at: 2016-04-06T01:10:02+00:00
[INFO] Final Memory: 37M/600M
[INFO] ------------------------------------------------------------------------
[ERROR] Failed to execute goal org.apache.maven.plugins:maven-surefire-plugin:2.17:test (default-test)
on project hadoop-mapreduce-client-jobclient: There was a timeout or other error in the fork
-> [Help 1]
[ERROR] 
[ERROR] To see the full stack trace of the errors, re-run Maven with the -e switch.
[ERROR] Re-run Maven using the -X switch to enable full debug logging.
[ERROR] 
[ERROR] For more information about the errors and possible solutions, please read the following
articles:
[ERROR] [Help 1] http://cwiki.apache.org/confluence/display/MAVEN/MojoFailureException
[ERROR] 
[ERROR] After correcting the problems, you can resume the build with the command
[ERROR]   mvn <goals> -rf :hadoop-mapreduce-client-jobclient
Build step 'Execute shell' marked build as failure
[FINDBUGS] Skipping publisher since build result is FAILURE
Archiving artifacts
Recording test results
Email was triggered for: Failure - Any
Sending email for trigger: Failure - Any



###################################################################################
############################## FAILED TESTS (if any) ##############################
2 tests failed.
FAILED:  org.apache.hadoop.mapreduce.v2.TestMRJobs.testJobWithChangePriority

Error Message:
expected:<DEFAULT> but was:<HIGH>

Stack Trace:
java.lang.AssertionError: expected:<DEFAULT> but was:<HIGH>
	at org.junit.Assert.fail(Assert.java:88)
	at org.junit.Assert.failNotEquals(Assert.java:743)
	at org.junit.Assert.assertEquals(Assert.java:118)
	at org.junit.Assert.assertEquals(Assert.java:144)
	at org.apache.hadoop.mapreduce.v2.TestMRJobs.testJobWithChangePriority(TestMRJobs.java:276)


FAILED:  org.apache.hadoop.mapreduce.v2.TestUberAM.testJobWithChangePriority

Error Message:
expected:<DEFAULT> but was:<HIGH>

Stack Trace:
java.lang.AssertionError: expected:<DEFAULT> but was:<HIGH>
	at org.junit.Assert.fail(Assert.java:88)
	at org.junit.Assert.failNotEquals(Assert.java:743)
	at org.junit.Assert.assertEquals(Assert.java:118)
	at org.junit.Assert.assertEquals(Assert.java:144)
	at org.apache.hadoop.mapreduce.v2.TestMRJobs.testJobWithChangePriority(TestMRJobs.java:276)
	at sun.reflect.NativeMethodAccessorImpl.invoke0(Native Method)
	at sun.reflect.NativeMethodAccessorImpl.invoke(NativeMethodAccessorImpl.java:57)
	at sun.reflect.DelegatingMethodAccessorImpl.invoke(DelegatingMethodAccessorImpl.java:43)
	at java.lang.reflect.Method.invoke(Method.java:606)
	at org.junit.runners.model.FrameworkMethod$1.runReflectiveCall(FrameworkMethod.java:47)
	at org.junit.internal.runners.model.ReflectiveCallable.run(ReflectiveCallable.java:12)
	at org.junit.runners.model.FrameworkMethod.invokeExplosively(FrameworkMethod.java:44)
	at org.junit.internal.runners.statements.InvokeMethod.evaluate(InvokeMethod.java:17)
	at org.junit.internal.runners.statements.FailOnTimeout$StatementThread.run(FailOnTimeout.java:74)



Mime
  • Unnamed multipart/mixed (inline, None, 0 bytes)
View raw message