hadoop-mapreduce-dev mailing list archives

Site index · List index
Message view « Date » · « Thread »
Top « Date » · « Thread »
From Apache Jenkins Server <jenk...@builds.apache.org>
Subject Hadoop-Mapreduce-trunk - Build # 3202 - Still Failing
Date Fri, 15 Apr 2016 07:22:22 GMT
See https://builds.apache.org/job/Hadoop-Mapreduce-trunk/3202/

###################################################################################
########################## LAST 60 LINES OF THE CONSOLE ###########################
[...truncated 31869 lines...]
Running org.apache.hadoop.mapred.TestInputPath
Tests run: 1, Failures: 0, Errors: 0, Skipped: 0, Time elapsed: 1.376 sec - in org.apache.hadoop.mapred.TestInputPath
Running org.apache.hadoop.mapred.TestLineRecordReaderJobs
Tests run: 2, Failures: 0, Errors: 0, Skipped: 0, Time elapsed: 4.562 sec - in org.apache.hadoop.mapred.TestLineRecordReaderJobs
Running org.apache.hadoop.mapred.TestMRIntermediateDataEncryption
Tests run: 4, Failures: 0, Errors: 0, Skipped: 0, Time elapsed: 256.762 sec - in org.apache.hadoop.mapred.TestMRIntermediateDataEncryption
Running org.apache.hadoop.mapred.TestAuditLogger
Tests run: 3, Failures: 0, Errors: 0, Skipped: 0, Time elapsed: 1.293 sec - in org.apache.hadoop.mapred.TestAuditLogger
Running org.apache.hadoop.mapred.TestYARNRunner

Results :

Failed tests: 
  TestUberAM.testSleepJob:57->TestMRJobs.testSleepJob:193->TestMRJobs.testSleepJobInternal:240->verifySleepJobCounters:71->TestMRJobs.verifySleepJobCounters:474
null
  TestUberAM.testSleepJobWithMultipleReducers:64->TestMRJobs.testSleepJob:193->TestMRJobs.testSleepJobInternal:240->verifySleepJobCounters:71->TestMRJobs.verifySleepJobCounters:474
null
  TestUberAM.testRandomWriter:84->TestMRJobs.testRandomWriter:539->verifyRandomWriterCounters:90->TestMRJobs.verifyRandomWriterCounters:551
null
  TestUberAM>TestMRJobs.testSleepJobWithRemoteJar:198->TestMRJobs.testSleepJobInternal:240->verifySleepJobCounters:71->TestMRJobs.verifySleepJobCounters:474
null

Tests run: 326, Failures: 4, Errors: 0, Skipped: 6

[INFO] ------------------------------------------------------------------------
[INFO] Reactor Summary:
[INFO] 
[INFO] Apache Hadoop MapReduce Client .................... SUCCESS [  2.894 s]
[INFO] Apache Hadoop MapReduce Core ...................... SUCCESS [01:51 min]
[INFO] Apache Hadoop MapReduce Common .................... SUCCESS [ 28.083 s]
[INFO] Apache Hadoop MapReduce Shuffle ................... SUCCESS [  5.076 s]
[INFO] Apache Hadoop MapReduce App ....................... SUCCESS [09:14 min]
[INFO] Apache Hadoop MapReduce HistoryServer ............. SUCCESS [05:37 min]
[INFO] Apache Hadoop MapReduce JobClient ................. FAILURE [  01:06 h]
[INFO] Apache Hadoop MapReduce HistoryServer Plugins ..... SKIPPED
[INFO] Apache Hadoop MapReduce NativeTask ................ SKIPPED
[INFO] Apache Hadoop MapReduce Examples .................. SKIPPED
[INFO] Apache Hadoop MapReduce ........................... SKIPPED
[INFO] ------------------------------------------------------------------------
[INFO] BUILD FAILURE
[INFO] ------------------------------------------------------------------------
[INFO] Total time: 01:24 h
[INFO] Finished at: 2016-04-15T07:22:05+00:00
[INFO] Final Memory: 38M/638M
[INFO] ------------------------------------------------------------------------
[ERROR] Failed to execute goal org.apache.maven.plugins:maven-surefire-plugin:2.17:test (default-test)
on project hadoop-mapreduce-client-jobclient: ExecutionException: java.lang.RuntimeException:
The forked VM terminated without properly saying goodbye. VM crash or System.exit called?
[ERROR] Command was /bin/sh -c cd /home/jenkins/jenkins-slave/workspace/Hadoop-Mapreduce-trunk/hadoop-mapreduce-project/hadoop-mapreduce-client/hadoop-mapreduce-client-jobclient
&& /home/jenkins/tools/java/jdk1.7.0_55/jre/bin/java -Xmx2048m -XX:MaxPermSize=768m
-XX:+HeapDumpOnOutOfMemoryError -jar /home/jenkins/jenkins-slave/workspace/Hadoop-Mapreduce-trunk/hadoop-mapreduce-project/hadoop-mapreduce-client/hadoop-mapreduce-client-jobclient/target/surefire/surefirebooter7201134271799159084.jar
/home/jenkins/jenkins-slave/workspace/Hadoop-Mapreduce-trunk/hadoop-mapreduce-project/hadoop-mapreduce-client/hadoop-mapreduce-client-jobclient/target/surefire/surefire2978371516253715184tmp
/home/jenkins/jenkins-slave/workspace/Hadoop-Mapreduce-trunk/hadoop-mapreduce-project/hadoop-mapreduce-client/hadoop-mapreduce-client-jobclient/target/surefire/surefire_1416064574178948746161tmp
[ERROR] -> [Help 1]
[ERROR] 
[ERROR] To see the full stack trace of the errors, re-run Maven with the -e switch.
[ERROR] Re-run Maven using the -X switch to enable full debug logging.
[ERROR] 
[ERROR] For more information about the errors and possible solutions, please read the following
articles:
[ERROR] [Help 1] http://cwiki.apache.org/confluence/display/MAVEN/MojoFailureException
[ERROR] 
[ERROR] After correcting the problems, you can resume the build with the command
[ERROR]   mvn <goals> -rf :hadoop-mapreduce-client-jobclient
Build step 'Execute shell' marked build as failure
[FINDBUGS] Skipping publisher since build result is FAILURE
Archiving artifacts
Recording test results
Email was triggered for: Failure - Any
Sending email for trigger: Failure - Any



###################################################################################
############################## FAILED TESTS (if any) ##############################
4 tests failed.
FAILED:  org.apache.hadoop.mapreduce.v2.TestUberAM.testSleepJob

Error Message:
null

Stack Trace:
java.lang.AssertionError: null
	at org.junit.Assert.fail(Assert.java:86)
	at org.junit.Assert.assertTrue(Assert.java:41)
	at org.junit.Assert.assertTrue(Assert.java:52)
	at org.apache.hadoop.mapreduce.v2.TestMRJobs.verifySleepJobCounters(TestMRJobs.java:474)
	at org.apache.hadoop.mapreduce.v2.TestUberAM.verifySleepJobCounters(TestUberAM.java:71)


FAILED:  org.apache.hadoop.mapreduce.v2.TestUberAM.testSleepJobWithMultipleReducers

Error Message:
null

Stack Trace:
java.lang.AssertionError: null
	at org.junit.Assert.fail(Assert.java:86)
	at org.junit.Assert.assertTrue(Assert.java:41)
	at org.junit.Assert.assertTrue(Assert.java:52)
	at org.apache.hadoop.mapreduce.v2.TestMRJobs.verifySleepJobCounters(TestMRJobs.java:474)
	at org.apache.hadoop.mapreduce.v2.TestUberAM.verifySleepJobCounters(TestUberAM.java:71)


FAILED:  org.apache.hadoop.mapreduce.v2.TestUberAM.testRandomWriter

Error Message:
null

Stack Trace:
java.lang.AssertionError: null
	at org.junit.Assert.fail(Assert.java:86)
	at org.junit.Assert.assertTrue(Assert.java:41)
	at org.junit.Assert.assertTrue(Assert.java:52)
	at org.apache.hadoop.mapreduce.v2.TestMRJobs.verifyRandomWriterCounters(TestMRJobs.java:551)
	at org.apache.hadoop.mapreduce.v2.TestUberAM.verifyRandomWriterCounters(TestUberAM.java:90)


FAILED:  org.apache.hadoop.mapreduce.v2.TestUberAM.testSleepJobWithRemoteJar

Error Message:
null

Stack Trace:
java.lang.AssertionError: null
	at org.junit.Assert.fail(Assert.java:86)
	at org.junit.Assert.assertTrue(Assert.java:41)
	at org.junit.Assert.assertTrue(Assert.java:52)
	at org.apache.hadoop.mapreduce.v2.TestMRJobs.verifySleepJobCounters(TestMRJobs.java:474)
	at org.apache.hadoop.mapreduce.v2.TestUberAM.verifySleepJobCounters(TestUberAM.java:71)



Mime
  • Unnamed multipart/mixed (inline, None, 0 bytes)
View raw message