hadoop-mapreduce-dev mailing list archives

Site index · List index
Message view « Date » · « Thread »
Top « Date » · « Thread »
From Apache Jenkins Server <jenk...@builds.apache.org>
Subject Hadoop-Mapreduce-trunk - Build # 3189 - Still Failing
Date Tue, 12 Apr 2016 22:11:12 GMT
See https://builds.apache.org/job/Hadoop-Mapreduce-trunk/3189/

###################################################################################
########################## LAST 60 LINES OF THE CONSOLE ###########################
[...truncated 32113 lines...]
Tests run: 1, Failures: 0, Errors: 0, Skipped: 0, Time elapsed: 1.219 sec - in org.apache.hadoop.util.TestMRCJCReflectionUtils
Running org.apache.hadoop.util.TestMRCJCRunJar
Tests run: 1, Failures: 0, Errors: 0, Skipped: 0, Time elapsed: 0.473 sec - in org.apache.hadoop.util.TestMRCJCRunJar
Running org.apache.hadoop.io.TestSequenceFileMergeProgress
Tests run: 3, Failures: 0, Errors: 0, Skipped: 0, Time elapsed: 4.33 sec - in org.apache.hadoop.io.TestSequenceFileMergeProgress

Results :

Tests in error: 
  TestMRTimelineEventHandling.testMapreduceJobTimelineServiceEnabled:172 » IO Jo...
  TestMiniMRProxyUser.setUp:88 » YarnRuntime java.lang.NoClassDefFoundError: org...
  TestJobOutputCommitter.setUp:64->HadoopTestCase.setUp:156 » YarnRuntime org.ap...
  TestJobOutputCommitter.tearDown:71 NullPointer
  TestJobOutputCommitter.setUp:64->HadoopTestCase.setUp:156 » YarnRuntime org.ap...
  TestJobOutputCommitter.tearDown:71 NullPointer
  TestJobOutputCommitter.setUp:64->HadoopTestCase.setUp:156 » YarnRuntime org.ap...
  TestJobOutputCommitter.tearDown:71 NullPointer

Tests run: 516, Failures: 0, Errors: 7, Skipped: 11

[INFO] ------------------------------------------------------------------------
[INFO] Reactor Summary:
[INFO] 
[INFO] Apache Hadoop MapReduce Client .................... SUCCESS [  5.394 s]
[INFO] Apache Hadoop MapReduce Core ...................... SUCCESS [03:14 min]
[INFO] Apache Hadoop MapReduce Common .................... SUCCESS [ 47.679 s]
[INFO] Apache Hadoop MapReduce Shuffle ................... SUCCESS [  9.820 s]
[INFO] Apache Hadoop MapReduce App ....................... SUCCESS [13:05 min]
[INFO] Apache Hadoop MapReduce HistoryServer ............. SUCCESS [07:43 min]
[INFO] Apache Hadoop MapReduce JobClient ................. FAILURE [  02:28 h]
[INFO] Apache Hadoop MapReduce HistoryServer Plugins ..... SKIPPED
[INFO] Apache Hadoop MapReduce NativeTask ................ SKIPPED
[INFO] Apache Hadoop MapReduce Examples .................. SKIPPED
[INFO] Apache Hadoop MapReduce ........................... SKIPPED
[INFO] ------------------------------------------------------------------------
[INFO] BUILD FAILURE
[INFO] ------------------------------------------------------------------------
[INFO] Total time: 02:53 h
[INFO] Finished at: 2016-04-12T22:10:53+00:00
[INFO] Final Memory: 41M/1017M
[INFO] ------------------------------------------------------------------------
[ERROR] Failed to execute goal org.apache.maven.plugins:maven-surefire-plugin:2.17:test (default-test)
on project hadoop-mapreduce-client-jobclient: ExecutionException: java.lang.RuntimeException:
The forked VM terminated without properly saying goodbye. VM crash or System.exit called?
[ERROR] Command was /bin/sh -c cd /home/jenkins/jenkins-slave/workspace/Hadoop-Mapreduce-trunk/hadoop-mapreduce-project/hadoop-mapreduce-client/hadoop-mapreduce-client-jobclient
&& /home/jenkins/tools/java/jdk1.7.0_55/jre/bin/java -Xmx2048m -XX:MaxPermSize=768m
-XX:+HeapDumpOnOutOfMemoryError -jar /home/jenkins/jenkins-slave/workspace/Hadoop-Mapreduce-trunk/hadoop-mapreduce-project/hadoop-mapreduce-client/hadoop-mapreduce-client-jobclient/target/surefire/surefirebooter434301716189836819.jar
/home/jenkins/jenkins-slave/workspace/Hadoop-Mapreduce-trunk/hadoop-mapreduce-project/hadoop-mapreduce-client/hadoop-mapreduce-client-jobclient/target/surefire/surefire1981900445191391168tmp
/home/jenkins/jenkins-slave/workspace/Hadoop-Mapreduce-trunk/hadoop-mapreduce-project/hadoop-mapreduce-client/hadoop-mapreduce-client-jobclient/target/surefire/surefire_2681726835145962152621tmp
[ERROR] -> [Help 1]
[ERROR] 
[ERROR] To see the full stack trace of the errors, re-run Maven with the -e switch.
[ERROR] Re-run Maven using the -X switch to enable full debug logging.
[ERROR] 
[ERROR] For more information about the errors and possible solutions, please read the following
articles:
[ERROR] [Help 1] http://cwiki.apache.org/confluence/display/MAVEN/MojoFailureException
[ERROR] 
[ERROR] After correcting the problems, you can resume the build with the command
[ERROR]   mvn <goals> -rf :hadoop-mapreduce-client-jobclient
Build step 'Execute shell' marked build as failure
[FINDBUGS] Skipping publisher since build result is FAILURE
Archiving artifacts
Recording test results
Email was triggered for: Failure - Any
Sending email for trigger: Failure - Any



###################################################################################
############################## FAILED TESTS (if any) ##############################
7 tests failed.
FAILED:  org.apache.hadoop.mapred.TestMRTimelineEventHandling.testMapreduceJobTimelineServiceEnabled

Error Message:
Job didn't finish in 30 seconds

Stack Trace:
java.io.IOException: Job didn't finish in 30 seconds
	at org.apache.hadoop.mapred.UtilsForTests.runJobSucceed(UtilsForTests.java:622)
	at org.apache.hadoop.mapred.TestMRTimelineEventHandling.testMapreduceJobTimelineServiceEnabled(TestMRTimelineEventHandling.java:172)


FAILED:  org.apache.hadoop.mapreduce.lib.output.TestJobOutputCommitter.testCustomCleanup

Error Message:
org.apache.hadoop.yarn.webapp.WebAppException: Error starting http server

Stack Trace:
org.apache.hadoop.yarn.exceptions.YarnRuntimeException: org.apache.hadoop.yarn.webapp.WebAppException:
Error starting http server
	at org.apache.hadoop.http.HttpServer2.start(HttpServer2.java:870)
	at org.apache.hadoop.yarn.webapp.WebApps$Builder.start(WebApps.java:348)
	at org.apache.hadoop.yarn.server.resourcemanager.ResourceManager.startWepApp(ResourceManager.java:1078)
	at org.apache.hadoop.yarn.server.resourcemanager.ResourceManager.serviceStart(ResourceManager.java:1176)
	at org.apache.hadoop.service.AbstractService.start(AbstractService.java:193)
	at org.apache.hadoop.yarn.server.MiniYARNCluster.startResourceManager(MiniYARNCluster.java:335)
	at org.apache.hadoop.yarn.server.MiniYARNCluster.access$300(MiniYARNCluster.java:112)
	at org.apache.hadoop.yarn.server.MiniYARNCluster$ResourceManagerWrapper.serviceStart(MiniYARNCluster.java:464)
	at org.apache.hadoop.service.AbstractService.start(AbstractService.java:193)
	at org.apache.hadoop.service.CompositeService.serviceStart(CompositeService.java:120)
	at org.apache.hadoop.yarn.server.MiniYARNCluster.serviceStart(MiniYARNCluster.java:292)
	at org.apache.hadoop.mapreduce.v2.MiniMRYarnCluster.serviceStart(MiniMRYarnCluster.java:191)
	at org.apache.hadoop.service.AbstractService.start(AbstractService.java:193)
	at org.apache.hadoop.mapred.MiniMRClientClusterFactory.create(MiniMRClientClusterFactory.java:80)
	at org.apache.hadoop.mapred.MiniMRCluster.<init>(MiniMRCluster.java:187)
	at org.apache.hadoop.mapred.MiniMRCluster.<init>(MiniMRCluster.java:175)
	at org.apache.hadoop.mapred.MiniMRCluster.<init>(MiniMRCluster.java:167)
	at org.apache.hadoop.mapred.MiniMRCluster.<init>(MiniMRCluster.java:159)
	at org.apache.hadoop.mapred.MiniMRCluster.<init>(MiniMRCluster.java:152)
	at org.apache.hadoop.mapred.MiniMRCluster.<init>(MiniMRCluster.java:145)
	at org.apache.hadoop.mapred.MiniMRCluster.<init>(MiniMRCluster.java:138)
	at org.apache.hadoop.mapred.MiniMRCluster.<init>(MiniMRCluster.java:133)
	at org.apache.hadoop.mapred.HadoopTestCase.setUp(HadoopTestCase.java:156)
	at org.apache.hadoop.mapreduce.lib.output.TestJobOutputCommitter.setUp(TestJobOutputCommitter.java:64)


FAILED:  org.apache.hadoop.mapreduce.lib.output.TestJobOutputCommitter.testCustomCleanup

Error Message:
null

Stack Trace:
java.lang.NullPointerException: null
	at org.apache.hadoop.mapreduce.lib.output.TestJobOutputCommitter.tearDown(TestJobOutputCommitter.java:71)


FAILED:  org.apache.hadoop.mapreduce.lib.output.TestJobOutputCommitter.testDefaultCleanupAndAbort

Error Message:
org.apache.hadoop.yarn.webapp.WebAppException: Error starting http server

Stack Trace:
org.apache.hadoop.yarn.exceptions.YarnRuntimeException: org.apache.hadoop.yarn.webapp.WebAppException:
Error starting http server
	at org.apache.hadoop.http.HttpServer2.start(HttpServer2.java:870)
	at org.apache.hadoop.yarn.webapp.WebApps$Builder.start(WebApps.java:348)
	at org.apache.hadoop.yarn.server.resourcemanager.ResourceManager.startWepApp(ResourceManager.java:1078)
	at org.apache.hadoop.yarn.server.resourcemanager.ResourceManager.serviceStart(ResourceManager.java:1176)
	at org.apache.hadoop.service.AbstractService.start(AbstractService.java:193)
	at org.apache.hadoop.yarn.server.MiniYARNCluster.startResourceManager(MiniYARNCluster.java:335)
	at org.apache.hadoop.yarn.server.MiniYARNCluster.access$300(MiniYARNCluster.java:112)
	at org.apache.hadoop.yarn.server.MiniYARNCluster$ResourceManagerWrapper.serviceStart(MiniYARNCluster.java:464)
	at org.apache.hadoop.service.AbstractService.start(AbstractService.java:193)
	at org.apache.hadoop.service.CompositeService.serviceStart(CompositeService.java:120)
	at org.apache.hadoop.yarn.server.MiniYARNCluster.serviceStart(MiniYARNCluster.java:292)
	at org.apache.hadoop.mapreduce.v2.MiniMRYarnCluster.serviceStart(MiniMRYarnCluster.java:191)
	at org.apache.hadoop.service.AbstractService.start(AbstractService.java:193)
	at org.apache.hadoop.mapred.MiniMRClientClusterFactory.create(MiniMRClientClusterFactory.java:80)
	at org.apache.hadoop.mapred.MiniMRCluster.<init>(MiniMRCluster.java:187)
	at org.apache.hadoop.mapred.MiniMRCluster.<init>(MiniMRCluster.java:175)
	at org.apache.hadoop.mapred.MiniMRCluster.<init>(MiniMRCluster.java:167)
	at org.apache.hadoop.mapred.MiniMRCluster.<init>(MiniMRCluster.java:159)
	at org.apache.hadoop.mapred.MiniMRCluster.<init>(MiniMRCluster.java:152)
	at org.apache.hadoop.mapred.MiniMRCluster.<init>(MiniMRCluster.java:145)
	at org.apache.hadoop.mapred.MiniMRCluster.<init>(MiniMRCluster.java:138)
	at org.apache.hadoop.mapred.MiniMRCluster.<init>(MiniMRCluster.java:133)
	at org.apache.hadoop.mapred.HadoopTestCase.setUp(HadoopTestCase.java:156)
	at org.apache.hadoop.mapreduce.lib.output.TestJobOutputCommitter.setUp(TestJobOutputCommitter.java:64)


FAILED:  org.apache.hadoop.mapreduce.lib.output.TestJobOutputCommitter.testDefaultCleanupAndAbort

Error Message:
null

Stack Trace:
java.lang.NullPointerException: null
	at org.apache.hadoop.mapreduce.lib.output.TestJobOutputCommitter.tearDown(TestJobOutputCommitter.java:71)


FAILED:  org.apache.hadoop.mapreduce.lib.output.TestJobOutputCommitter.testCustomAbort

Error Message:
org.apache.hadoop.yarn.webapp.WebAppException: Error starting http server

Stack Trace:
org.apache.hadoop.yarn.exceptions.YarnRuntimeException: org.apache.hadoop.yarn.webapp.WebAppException:
Error starting http server
	at org.apache.hadoop.http.HttpServer2.start(HttpServer2.java:870)
	at org.apache.hadoop.yarn.webapp.WebApps$Builder.start(WebApps.java:348)
	at org.apache.hadoop.yarn.server.resourcemanager.ResourceManager.startWepApp(ResourceManager.java:1078)
	at org.apache.hadoop.yarn.server.resourcemanager.ResourceManager.serviceStart(ResourceManager.java:1176)
	at org.apache.hadoop.service.AbstractService.start(AbstractService.java:193)
	at org.apache.hadoop.yarn.server.MiniYARNCluster.startResourceManager(MiniYARNCluster.java:335)
	at org.apache.hadoop.yarn.server.MiniYARNCluster.access$300(MiniYARNCluster.java:112)
	at org.apache.hadoop.yarn.server.MiniYARNCluster$ResourceManagerWrapper.serviceStart(MiniYARNCluster.java:464)
	at org.apache.hadoop.service.AbstractService.start(AbstractService.java:193)
	at org.apache.hadoop.service.CompositeService.serviceStart(CompositeService.java:120)
	at org.apache.hadoop.yarn.server.MiniYARNCluster.serviceStart(MiniYARNCluster.java:292)
	at org.apache.hadoop.mapreduce.v2.MiniMRYarnCluster.serviceStart(MiniMRYarnCluster.java:191)
	at org.apache.hadoop.service.AbstractService.start(AbstractService.java:193)
	at org.apache.hadoop.mapred.MiniMRClientClusterFactory.create(MiniMRClientClusterFactory.java:80)
	at org.apache.hadoop.mapred.MiniMRCluster.<init>(MiniMRCluster.java:187)
	at org.apache.hadoop.mapred.MiniMRCluster.<init>(MiniMRCluster.java:175)
	at org.apache.hadoop.mapred.MiniMRCluster.<init>(MiniMRCluster.java:167)
	at org.apache.hadoop.mapred.MiniMRCluster.<init>(MiniMRCluster.java:159)
	at org.apache.hadoop.mapred.MiniMRCluster.<init>(MiniMRCluster.java:152)
	at org.apache.hadoop.mapred.MiniMRCluster.<init>(MiniMRCluster.java:145)
	at org.apache.hadoop.mapred.MiniMRCluster.<init>(MiniMRCluster.java:138)
	at org.apache.hadoop.mapred.MiniMRCluster.<init>(MiniMRCluster.java:133)
	at org.apache.hadoop.mapred.HadoopTestCase.setUp(HadoopTestCase.java:156)
	at org.apache.hadoop.mapreduce.lib.output.TestJobOutputCommitter.setUp(TestJobOutputCommitter.java:64)


FAILED:  org.apache.hadoop.mapreduce.lib.output.TestJobOutputCommitter.testCustomAbort

Error Message:
null

Stack Trace:
java.lang.NullPointerException: null
	at org.apache.hadoop.mapreduce.lib.output.TestJobOutputCommitter.tearDown(TestJobOutputCommitter.java:71)



Mime
  • Unnamed multipart/mixed (inline, None, 0 bytes)
View raw message