hadoop-mapreduce-dev mailing list archives

Site index · List index
Message view « Date » · « Thread »
Top « Date » · « Thread »
From Apache Jenkins Server <jenk...@builds.apache.org>
Subject Hadoop-Mapreduce-trunk-Java8 - Build # 1238 - Still Failing
Date Tue, 05 Apr 2016 23:59:47 GMT
See https://builds.apache.org/job/Hadoop-Mapreduce-trunk-Java8/1238/

###################################################################################
########################## LAST 60 LINES OF THE CONSOLE ###########################
[...truncated 9634 lines...]
Running org.apache.hadoop.util.TestMRCJCReflectionUtils
Tests run: 1, Failures: 0, Errors: 0, Skipped: 0, Time elapsed: 0.521 sec - in org.apache.hadoop.util.TestMRCJCReflectionUtils
Java HotSpot(TM) 64-Bit Server VM warning: ignoring option MaxPermSize=768m; support was removed
in 8.0
Running org.apache.hadoop.util.TestMRCJCRunJar
Tests run: 1, Failures: 0, Errors: 0, Skipped: 0, Time elapsed: 0.228 sec - in org.apache.hadoop.util.TestMRCJCRunJar
Java HotSpot(TM) 64-Bit Server VM warning: ignoring option MaxPermSize=768m; support was removed
in 8.0
Running org.apache.hadoop.io.TestSequenceFileMergeProgress
Tests run: 3, Failures: 0, Errors: 0, Skipped: 0, Time elapsed: 1.505 sec - in org.apache.hadoop.io.TestSequenceFileMergeProgress

Results :

Failed tests: 
  TestMRJobs.testJobWithChangePriority:276 expected:<DEFAULT> but was:<HIGH>
  TestUberAM>TestMRJobs.testJobWithChangePriority:276 expected:<DEFAULT> but was:<HIGH>

Tests in error: 
  TestMRKeyFieldBasedComparator.testBasicUnixComparator:111->testComparator:75 ยป Runtime

Tests run: 532, Failures: 2, Errors: 1, Skipped: 11

[INFO] ------------------------------------------------------------------------
[INFO] Reactor Summary:
[INFO] 
[INFO] Apache Hadoop MapReduce Client .................... SUCCESS [  2.147 s]
[INFO] Apache Hadoop MapReduce Core ...................... SUCCESS [01:38 min]
[INFO] Apache Hadoop MapReduce Common .................... SUCCESS [ 24.422 s]
[INFO] Apache Hadoop MapReduce Shuffle ................... SUCCESS [  4.242 s]
[INFO] Apache Hadoop MapReduce App ....................... SUCCESS [10:57 min]
[INFO] Apache Hadoop MapReduce HistoryServer ............. SUCCESS [06:10 min]
[INFO] Apache Hadoop MapReduce JobClient ................. FAILURE [  01:49 h]
[INFO] Apache Hadoop MapReduce HistoryServer Plugins ..... SKIPPED
[INFO] Apache Hadoop MapReduce NativeTask ................ SKIPPED
[INFO] Apache Hadoop MapReduce Examples .................. SKIPPED
[INFO] Apache Hadoop MapReduce ........................... SKIPPED
[INFO] ------------------------------------------------------------------------
[INFO] BUILD FAILURE
[INFO] ------------------------------------------------------------------------
[INFO] Total time: 02:08 h
[INFO] Finished at: 2016-04-05T23:59:38+00:00
[INFO] Final Memory: 34M/129M
[INFO] ------------------------------------------------------------------------
[ERROR] Failed to execute goal org.apache.maven.plugins:maven-surefire-plugin:2.17:test (default-test)
on project hadoop-mapreduce-client-jobclient: ExecutionException: java.lang.RuntimeException:
The forked VM terminated without properly saying goodbye. VM crash or System.exit called?
[ERROR] Command was /bin/sh -c cd /home/jenkins/jenkins-slave/workspace/Hadoop-Mapreduce-trunk-Java8/hadoop-mapreduce-project/hadoop-mapreduce-client/hadoop-mapreduce-client-jobclient
&& /home/jenkins/tools/java/jdk1.8.0/jre/bin/java -Xmx2048m -XX:MaxPermSize=768m -XX:+HeapDumpOnOutOfMemoryError
-jar /home/jenkins/jenkins-slave/workspace/Hadoop-Mapreduce-trunk-Java8/hadoop-mapreduce-project/hadoop-mapreduce-client/hadoop-mapreduce-client-jobclient/target/surefire/surefirebooter7208504992669182677.jar
/home/jenkins/jenkins-slave/workspace/Hadoop-Mapreduce-trunk-Java8/hadoop-mapreduce-project/hadoop-mapreduce-client/hadoop-mapreduce-client-jobclient/target/surefire/surefire5922963332708881714tmp
/home/jenkins/jenkins-slave/workspace/Hadoop-Mapreduce-trunk-Java8/hadoop-mapreduce-project/hadoop-mapreduce-client/hadoop-mapreduce-client-jobclient/target/surefire/surefire_2754339423566657532336tmp
[ERROR] -> [Help 1]
[ERROR] 
[ERROR] To see the full stack trace of the errors, re-run Maven with the -e switch.
[ERROR] Re-run Maven using the -X switch to enable full debug logging.
[ERROR] 
[ERROR] For more information about the errors and possible solutions, please read the following
articles:
[ERROR] [Help 1] http://cwiki.apache.org/confluence/display/MAVEN/MojoFailureException
[ERROR] 
[ERROR] After correcting the problems, you can resume the build with the command
[ERROR]   mvn <goals> -rf :hadoop-mapreduce-client-jobclient
Build step 'Execute shell' marked build as failure
[FINDBUGS] Skipping publisher since build result is FAILURE
Archiving artifacts
Recording test results
Email was triggered for: Failure - Any
Sending email for trigger: Failure - Any



###################################################################################
############################## FAILED TESTS (if any) ##############################
3 tests failed.
FAILED:  org.apache.hadoop.mapreduce.lib.partition.TestMRKeyFieldBasedComparator.testBasicUnixComparator

Error Message:
java.util.zip.ZipException: ZIP_Read: error reading zip file

Stack Trace:
java.lang.RuntimeException: java.util.zip.ZipException: ZIP_Read: error reading zip file
	at java.util.zip.ZipFile.read(Native Method)
	at java.util.zip.ZipFile.access$1400(ZipFile.java:61)
	at java.util.zip.ZipFile$ZipFileInputStream.read(ZipFile.java:715)
	at java.util.zip.ZipFile$ZipFileInflaterInputStream.fill(ZipFile.java:420)
	at java.util.zip.InflaterInputStream.read(InflaterInputStream.java:158)
	at java.io.FilterInputStream.read(FilterInputStream.java:133)
	at org.apache.xerces.impl.XMLEntityManager$RewindableInputStream.read(Unknown Source)
	at org.apache.xerces.impl.io.UTF8Reader.read(Unknown Source)
	at org.apache.xerces.impl.XMLEntityScanner.load(Unknown Source)
	at org.apache.xerces.impl.XMLEntityScanner.scanContent(Unknown Source)
	at org.apache.xerces.impl.XMLDocumentFragmentScannerImpl.scanContent(Unknown Source)
	at org.apache.xerces.impl.XMLDocumentFragmentScannerImpl$FragmentContentDispatcher.dispatch(Unknown
Source)
	at org.apache.xerces.impl.XMLDocumentFragmentScannerImpl.scanDocument(Unknown Source)
	at org.apache.xerces.parsers.XML11Configuration.parse(Unknown Source)
	at org.apache.xerces.parsers.XML11Configuration.parse(Unknown Source)
	at org.apache.xerces.parsers.XMLParser.parse(Unknown Source)
	at org.apache.xerces.parsers.DOMParser.parse(Unknown Source)
	at org.apache.xerces.jaxp.DocumentBuilderImpl.parse(Unknown Source)
	at javax.xml.parsers.DocumentBuilder.parse(DocumentBuilder.java:150)
	at org.apache.hadoop.conf.Configuration.parse(Configuration.java:2568)
	at org.apache.hadoop.conf.Configuration.parse(Configuration.java:2556)
	at org.apache.hadoop.conf.Configuration.loadResource(Configuration.java:2627)
	at org.apache.hadoop.conf.Configuration.loadResources(Configuration.java:2580)
	at org.apache.hadoop.conf.Configuration.getProps(Configuration.java:2484)
	at org.apache.hadoop.conf.Configuration.get(Configuration.java:1045)
	at org.apache.hadoop.conf.Configuration.getTrimmed(Configuration.java:1095)
	at org.apache.hadoop.conf.Configuration.getClass(Configuration.java:2268)
	at org.apache.hadoop.fs.AbstractFileSystem.createFileSystem(AbstractFileSystem.java:159)
	at org.apache.hadoop.fs.AbstractFileSystem.get(AbstractFileSystem.java:250)
	at org.apache.hadoop.fs.FileContext$2.run(FileContext.java:332)
	at org.apache.hadoop.fs.FileContext$2.run(FileContext.java:329)
	at java.security.AccessController.doPrivileged(Native Method)
	at javax.security.auth.Subject.doAs(Subject.java:422)
	at org.apache.hadoop.security.UserGroupInformation.doAs(UserGroupInformation.java:1742)
	at org.apache.hadoop.fs.FileContext.getAbstractFileSystem(FileContext.java:329)
	at org.apache.hadoop.fs.FileContext.getFileContext(FileContext.java:446)
	at org.apache.hadoop.fs.FileContext.getFileContext(FileContext.java:423)
	at org.apache.hadoop.fs.FileContext.getLocalFSFileContext(FileContext.java:409)
	at org.apache.hadoop.mapred.LocalDistributedCacheManager.setup(LocalDistributedCacheManager.java:115)
	at org.apache.hadoop.mapred.LocalJobRunner$Job.<init>(LocalJobRunner.java:172)
	at org.apache.hadoop.mapred.LocalJobRunner.submitJob(LocalJobRunner.java:788)
	at org.apache.hadoop.mapreduce.JobSubmitter.submitJobInternal(JobSubmitter.java:244)
	at org.apache.hadoop.mapreduce.Job$11.run(Job.java:1341)
	at org.apache.hadoop.mapreduce.Job$11.run(Job.java:1338)
	at java.security.AccessController.doPrivileged(Native Method)
	at javax.security.auth.Subject.doAs(Subject.java:422)
	at org.apache.hadoop.security.UserGroupInformation.doAs(UserGroupInformation.java:1742)
	at org.apache.hadoop.mapreduce.Job.submit(Job.java:1338)
	at org.apache.hadoop.mapreduce.Job.waitForCompletion(Job.java:1359)
	at org.apache.hadoop.mapreduce.lib.partition.TestMRKeyFieldBasedComparator.testComparator(TestMRKeyFieldBasedComparator.java:75)
	at org.apache.hadoop.mapreduce.lib.partition.TestMRKeyFieldBasedComparator.testBasicUnixComparator(TestMRKeyFieldBasedComparator.java:111)


FAILED:  org.apache.hadoop.mapreduce.v2.TestMRJobs.testJobWithChangePriority

Error Message:
expected:<DEFAULT> but was:<HIGH>

Stack Trace:
java.lang.AssertionError: expected:<DEFAULT> but was:<HIGH>
	at org.junit.Assert.fail(Assert.java:88)
	at org.junit.Assert.failNotEquals(Assert.java:743)
	at org.junit.Assert.assertEquals(Assert.java:118)
	at org.junit.Assert.assertEquals(Assert.java:144)
	at org.apache.hadoop.mapreduce.v2.TestMRJobs.testJobWithChangePriority(TestMRJobs.java:276)


FAILED:  org.apache.hadoop.mapreduce.v2.TestUberAM.testJobWithChangePriority

Error Message:
expected:<DEFAULT> but was:<HIGH>

Stack Trace:
java.lang.AssertionError: expected:<DEFAULT> but was:<HIGH>
	at org.junit.Assert.fail(Assert.java:88)
	at org.junit.Assert.failNotEquals(Assert.java:743)
	at org.junit.Assert.assertEquals(Assert.java:118)
	at org.junit.Assert.assertEquals(Assert.java:144)
	at org.apache.hadoop.mapreduce.v2.TestMRJobs.testJobWithChangePriority(TestMRJobs.java:276)
	at sun.reflect.NativeMethodAccessorImpl.invoke0(Native Method)
	at sun.reflect.NativeMethodAccessorImpl.invoke(NativeMethodAccessorImpl.java:62)
	at sun.reflect.DelegatingMethodAccessorImpl.invoke(DelegatingMethodAccessorImpl.java:43)
	at java.lang.reflect.Method.invoke(Method.java:483)
	at org.junit.runners.model.FrameworkMethod$1.runReflectiveCall(FrameworkMethod.java:47)
	at org.junit.internal.runners.model.ReflectiveCallable.run(ReflectiveCallable.java:12)
	at org.junit.runners.model.FrameworkMethod.invokeExplosively(FrameworkMethod.java:44)
	at org.junit.internal.runners.statements.InvokeMethod.evaluate(InvokeMethod.java:17)
	at org.junit.internal.runners.statements.FailOnTimeout$StatementThread.run(FailOnTimeout.java:74)



Mime
  • Unnamed multipart/mixed (inline, None, 0 bytes)
View raw message