hadoop-mapreduce-dev mailing list archives

Site index · List index
Message view « Date » · « Thread »
Top « Date » · « Thread »
From Apache Jenkins Server <jenk...@builds.apache.org>
Subject Hadoop-Mapreduce-trunk - Build # 3220 - Still Failing
Date Wed, 20 Apr 2016 21:51:56 GMT
See https://builds.apache.org/job/Hadoop-Mapreduce-trunk/3220/

###################################################################################
########################## LAST 60 LINES OF THE CONSOLE ###########################
[...truncated 31610 lines...]
Tests run: 22, Failures: 0, Errors: 0, Skipped: 0, Time elapsed: 21.12 sec - in org.apache.hadoop.mapreduce.v2.hs.webapp.TestHsWebServicesJobs
Running org.apache.hadoop.mapreduce.v2.hs.webapp.TestHsWebServices
Tests run: 11, Failures: 0, Errors: 0, Skipped: 0, Time elapsed: 12.931 sec - in org.apache.hadoop.mapreduce.v2.hs.webapp.TestHsWebServices
Running org.apache.hadoop.mapreduce.v2.hs.TestJobHistory
Tests run: 9, Failures: 0, Errors: 0, Skipped: 0, Time elapsed: 32.165 sec - in org.apache.hadoop.mapreduce.v2.hs.TestJobHistory
Running org.apache.hadoop.mapreduce.v2.hs.TestJobHistoryEvents
Tests run: 4, Failures: 0, Errors: 0, Skipped: 0, Time elapsed: 43.573 sec - in org.apache.hadoop.mapreduce.v2.hs.TestJobHistoryEvents
Running org.apache.hadoop.mapreduce.v2.hs.TestHistoryFileManager
Tests run: 8, Failures: 0, Errors: 0, Skipped: 0, Time elapsed: 22.79 sec - in org.apache.hadoop.mapreduce.v2.hs.TestHistoryFileManager
Running org.apache.hadoop.mapreduce.v2.hs.TestJHSDelegationTokenSecretManager
Tests run: 1, Failures: 0, Errors: 0, Skipped: 0, Time elapsed: 1.18 sec - in org.apache.hadoop.mapreduce.v2.hs.TestJHSDelegationTokenSecretManager

Results :

Tests in error: 
  TestJobListCache.testAddExisting:39 ยป  test timed out after 1000 milliseconds

Tests run: 209, Failures: 0, Errors: 1, Skipped: 0

[INFO] ------------------------------------------------------------------------
[INFO] Reactor Summary:
[INFO] 
[INFO] Apache Hadoop MapReduce Client .................... SUCCESS [  5.674 s]
[INFO] Apache Hadoop MapReduce Core ...................... SUCCESS [03:16 min]
[INFO] Apache Hadoop MapReduce Common .................... SUCCESS [ 47.638 s]
[INFO] Apache Hadoop MapReduce Shuffle ................... SUCCESS [  9.119 s]
[INFO] Apache Hadoop MapReduce App ....................... SUCCESS [12:56 min]
[INFO] Apache Hadoop MapReduce HistoryServer ............. FAILURE [07:42 min]
[INFO] Apache Hadoop MapReduce JobClient ................. SKIPPED
[INFO] Apache Hadoop MapReduce HistoryServer Plugins ..... SKIPPED
[INFO] Apache Hadoop MapReduce NativeTask ................ SKIPPED
[INFO] Apache Hadoop MapReduce Examples .................. SKIPPED
[INFO] Apache Hadoop MapReduce ........................... SKIPPED
[INFO] ------------------------------------------------------------------------
[INFO] BUILD FAILURE
[INFO] ------------------------------------------------------------------------
[INFO] Total time: 25:00 min
[INFO] Finished at: 2016-04-20T21:51:49+00:00
[INFO] Final Memory: 38M/1198M
[INFO] ------------------------------------------------------------------------
[ERROR] Failed to execute goal org.apache.maven.plugins:maven-surefire-plugin:2.17:test (default-test)
on project hadoop-mapreduce-client-hs: There are test failures.
[ERROR] 
[ERROR] Please refer to /home/jenkins/jenkins-slave/workspace/Hadoop-Mapreduce-trunk/hadoop-mapreduce-project/hadoop-mapreduce-client/hadoop-mapreduce-client-hs/target/surefire-reports
for the individual test results.
[ERROR] -> [Help 1]
[ERROR] 
[ERROR] To see the full stack trace of the errors, re-run Maven with the -e switch.
[ERROR] Re-run Maven using the -X switch to enable full debug logging.
[ERROR] 
[ERROR] For more information about the errors and possible solutions, please read the following
articles:
[ERROR] [Help 1] http://cwiki.apache.org/confluence/display/MAVEN/MojoFailureException
[ERROR] 
[ERROR] After correcting the problems, you can resume the build with the command
[ERROR]   mvn <goals> -rf :hadoop-mapreduce-client-hs
Build step 'Execute shell' marked build as failure
[FINDBUGS] Skipping publisher since build result is FAILURE
Archiving artifacts
Recording test results
Email was triggered for: Failure - Any
Sending email for trigger: Failure - Any



###################################################################################
############################## FAILED TESTS (if any) ##############################
1 tests failed.
FAILED:  org.apache.hadoop.mapreduce.v2.hs.TestJobListCache.testAddExisting

Error Message:
test timed out after 1000 milliseconds

Stack Trace:
java.lang.Exception: test timed out after 1000 milliseconds
	at sun.misc.Unsafe.putOrderedObject(Native Method)
	at java.util.concurrent.ConcurrentHashMap.setEntryAt(ConcurrentHashMap.java:316)
	at java.util.concurrent.ConcurrentHashMap$Segment.put(ConcurrentHashMap.java:462)
	at java.util.concurrent.ConcurrentHashMap.putIfAbsent(ConcurrentHashMap.java:1150)
	at java.lang.ClassLoader.getClassLoadingLock(ClassLoader.java:464)
	at java.lang.ClassLoader.loadClass(ClassLoader.java:405)
	at sun.misc.Launcher$AppClassLoader.loadClass(Launcher.java:308)
	at java.lang.ClassLoader.loadClass(ClassLoader.java:358)
	at org.mockito.cglib.core.AbstractClassGenerator.<init>(AbstractClassGenerator.java:39)
	at org.mockito.cglib.core.KeyFactory$Generator.<init>(KeyFactory.java:128)
	at org.mockito.cglib.core.KeyFactory.create(KeyFactory.java:113)
	at org.mockito.cglib.core.KeyFactory.create(KeyFactory.java:109)
	at org.mockito.cglib.core.KeyFactory.create(KeyFactory.java:105)
	at org.mockito.cglib.proxy.Enhancer.<clinit>(Enhancer.java:70)
	at org.mockito.internal.creation.jmock.ClassImposterizer.createProxyClass(ClassImposterizer.java:68)
	at org.mockito.internal.creation.jmock.ClassImposterizer.imposterise(ClassImposterizer.java:50)
	at org.mockito.internal.util.MockUtil.createMock(MockUtil.java:54)
	at org.mockito.internal.MockitoCore.mock(MockitoCore.java:45)
	at org.mockito.Mockito.mock(Mockito.java:921)
	at org.mockito.Mockito.mock(Mockito.java:816)
	at org.apache.hadoop.mapreduce.v2.hs.TestJobListCache.testAddExisting(TestJobListCache.java:39)



Mime
  • Unnamed multipart/mixed (inline, None, 0 bytes)
View raw message