hadoop-mapreduce-dev mailing list archives

Site index · List index
Message view « Date » · « Thread »
Top « Date » · « Thread »
From Apache Jenkins Server <jenk...@builds.apache.org>
Subject Hadoop-Mapreduce-trunk-Java8 - Build # 1242 - Still Failing
Date Wed, 06 Apr 2016 20:44:40 GMT
See https://builds.apache.org/job/Hadoop-Mapreduce-trunk-Java8/1242/

###################################################################################
########################## LAST 60 LINES OF THE CONSOLE ###########################
[...truncated 10005 lines...]

Results :

Failed tests: 
  TestUberAM>TestMRJobs.testJobWithChangePriority:276 expected:<DEFAULT> but was:<HIGH>
  TestMRJobs.testJobWithChangePriority:276 expected:<DEFAULT> but was:<HIGH>

Tests in error: 
  TestClusterMRNotification>NotificationTestCase.testMR:187 » IO Job didn't fini...
  TestMiniMRBringup.testBringUp:34 » YarnRuntime org.apache.hadoop.yarn.webapp.W...
  TestMRTimelineEventHandling.testMRTimelineEventHandling:136 » NoClassDefFound ...
  TestMerge.testMerge:91 » NoClassDefFound org/apache/hadoop/hdfs/server/namenod...
  TestClusterMapReduceTestCase>ClusterMapReduceTestCase.setUp:56->ClusterMapReduceTestCase.startCluster:87
» NoClassDefFound
  TestClusterMapReduceTestCase>ClusterMapReduceTestCase.setUp:56->ClusterMapReduceTestCase.startCluster:87
» NoClassDefFound
  TestClusterMapReduceTestCase>ClusterMapReduceTestCase.setUp:56->ClusterMapReduceTestCase.startCluster:87
» NoClassDefFound
  TestClusterMapReduceTestCase>ClusterMapReduceTestCase.setUp:56->ClusterMapReduceTestCase.startCluster:87
» NoClassDefFound
  TestMiniMRChildTask.setup:356 NoClassDefFound org/apache/hadoop/yarn/server/Mi...

Tests run: 521, Failures: 2, Errors: 8, Skipped: 11

[INFO] ------------------------------------------------------------------------
[INFO] Reactor Summary:
[INFO] 
[INFO] Apache Hadoop MapReduce Client .................... SUCCESS [  2.635 s]
[INFO] Apache Hadoop MapReduce Core ...................... SUCCESS [01:45 min]
[INFO] Apache Hadoop MapReduce Common .................... SUCCESS [ 25.983 s]
[INFO] Apache Hadoop MapReduce Shuffle ................... SUCCESS [  4.487 s]
[INFO] Apache Hadoop MapReduce App ....................... SUCCESS [11:48 min]
[INFO] Apache Hadoop MapReduce HistoryServer ............. SUCCESS [06:30 min]
[INFO] Apache Hadoop MapReduce JobClient ................. FAILURE [  01:32 h]
[INFO] Apache Hadoop MapReduce HistoryServer Plugins ..... SKIPPED
[INFO] Apache Hadoop MapReduce NativeTask ................ SKIPPED
[INFO] Apache Hadoop MapReduce Examples .................. SKIPPED
[INFO] Apache Hadoop MapReduce ........................... SKIPPED
[INFO] ------------------------------------------------------------------------
[INFO] BUILD FAILURE
[INFO] ------------------------------------------------------------------------
[INFO] Total time: 01:52 h
[INFO] Finished at: 2016-04-06T20:44:07+00:00
[INFO] Final Memory: 34M/140M
[INFO] ------------------------------------------------------------------------
[ERROR] Failed to execute goal org.apache.maven.plugins:maven-surefire-plugin:2.17:test (default-test)
on project hadoop-mapreduce-client-jobclient: ExecutionException: java.lang.RuntimeException:
The forked VM terminated without properly saying goodbye. VM crash or System.exit called?
[ERROR] Command was /bin/sh -c cd /home/jenkins/jenkins-slave/workspace/Hadoop-Mapreduce-trunk-Java8/hadoop-mapreduce-project/hadoop-mapreduce-client/hadoop-mapreduce-client-jobclient
&& /home/jenkins/tools/java/jdk1.8.0/jre/bin/java -Xmx2048m -XX:MaxPermSize=768m -XX:+HeapDumpOnOutOfMemoryError
-jar /home/jenkins/jenkins-slave/workspace/Hadoop-Mapreduce-trunk-Java8/hadoop-mapreduce-project/hadoop-mapreduce-client/hadoop-mapreduce-client-jobclient/target/surefire/surefirebooter7581852704555090576.jar
/home/jenkins/jenkins-slave/workspace/Hadoop-Mapreduce-trunk-Java8/hadoop-mapreduce-project/hadoop-mapreduce-client/hadoop-mapreduce-client-jobclient/target/surefire/surefire3006425328570174400tmp
/home/jenkins/jenkins-slave/workspace/Hadoop-Mapreduce-trunk-Java8/hadoop-mapreduce-project/hadoop-mapreduce-client/hadoop-mapreduce-client-jobclient/target/surefire/surefire_280764486093055778682tmp
[ERROR] -> [Help 1]
[ERROR] 
[ERROR] To see the full stack trace of the errors, re-run Maven with the -e switch.
[ERROR] Re-run Maven using the -X switch to enable full debug logging.
[ERROR] 
[ERROR] For more information about the errors and possible solutions, please read the following
articles:
[ERROR] [Help 1] http://cwiki.apache.org/confluence/display/MAVEN/MojoFailureException
[ERROR] 
[ERROR] After correcting the problems, you can resume the build with the command
[ERROR]   mvn <goals> -rf :hadoop-mapreduce-client-jobclient
Build step 'Execute shell' marked build as failure
[FINDBUGS] Skipping publisher since build result is FAILURE
Archiving artifacts
Recording test results
Email was triggered for: Failure - Any
Sending email for trigger: Failure - Any



###################################################################################
############################## FAILED TESTS (if any) ##############################
10 tests failed.
FAILED:  org.apache.hadoop.mapred.TestClusterMRNotification.testMR

Error Message:
Job didn't finish in 30 seconds

Stack Trace:
java.io.IOException: Job didn't finish in 30 seconds
	at org.apache.hadoop.mapred.UtilsForTests.runJobKill(UtilsForTests.java:672)
	at org.apache.hadoop.mapred.NotificationTestCase.testMR(NotificationTestCase.java:187)
	at sun.reflect.NativeMethodAccessorImpl.invoke0(Native Method)
	at sun.reflect.NativeMethodAccessorImpl.invoke(NativeMethodAccessorImpl.java:62)
	at sun.reflect.DelegatingMethodAccessorImpl.invoke(DelegatingMethodAccessorImpl.java:43)
	at java.lang.reflect.Method.invoke(Method.java:483)
	at org.junit.runners.model.FrameworkMethod$1.runReflectiveCall(FrameworkMethod.java:47)
	at org.junit.internal.runners.model.ReflectiveCallable.run(ReflectiveCallable.java:12)
	at org.junit.runners.model.FrameworkMethod.invokeExplosively(FrameworkMethod.java:44)
	at org.junit.internal.runners.statements.InvokeMethod.evaluate(InvokeMethod.java:17)
	at org.junit.internal.runners.statements.RunBefores.evaluate(RunBefores.java:26)
	at org.junit.internal.runners.statements.RunAfters.evaluate(RunAfters.java:27)
	at org.junit.runners.ParentRunner.runLeaf(ParentRunner.java:271)
	at org.junit.runners.BlockJUnit4ClassRunner.runChild(BlockJUnit4ClassRunner.java:70)
	at org.junit.runners.BlockJUnit4ClassRunner.runChild(BlockJUnit4ClassRunner.java:50)
	at org.junit.runners.ParentRunner$3.run(ParentRunner.java:238)
	at org.junit.runners.ParentRunner$1.schedule(ParentRunner.java:63)
	at org.junit.runners.ParentRunner.runChildren(ParentRunner.java:236)
	at org.junit.runners.ParentRunner.access$000(ParentRunner.java:53)
	at org.junit.runners.ParentRunner$2.evaluate(ParentRunner.java:229)
	at org.junit.runners.ParentRunner.run(ParentRunner.java:309)
	at org.apache.maven.surefire.junit4.JUnit4Provider.execute(JUnit4Provider.java:264)
	at org.apache.maven.surefire.junit4.JUnit4Provider.executeTestSet(JUnit4Provider.java:153)
	at org.apache.maven.surefire.junit4.JUnit4Provider.invoke(JUnit4Provider.java:124)
	at org.apache.maven.surefire.booter.ForkedBooter.invokeProviderInSameClassLoader(ForkedBooter.java:200)
	at org.apache.maven.surefire.booter.ForkedBooter.runSuitesInProcess(ForkedBooter.java:153)
	at org.apache.maven.surefire.booter.ForkedBooter.main(ForkedBooter.java:103)


FAILED:  org.apache.hadoop.mapred.TestClusterMapReduceTestCase.testMapReduceRestarting

Error Message:
org/apache/hadoop/yarn/exceptions/YarnRuntimeException

Stack Trace:
java.lang.NoClassDefFoundError: org/apache/hadoop/yarn/exceptions/YarnRuntimeException
	at org.apache.hadoop.mapred.MiniMRClientClusterFactory.create(MiniMRClientClusterFactory.java:58)
	at org.apache.hadoop.mapred.MiniMRCluster.<init>(MiniMRCluster.java:187)
	at org.apache.hadoop.mapred.MiniMRCluster.<init>(MiniMRCluster.java:175)
	at org.apache.hadoop.mapred.MiniMRCluster.<init>(MiniMRCluster.java:167)
	at org.apache.hadoop.mapred.ClusterMapReduceTestCase$ConfigurableMiniMRCluster.<init>(ClusterMapReduceTestCase.java:101)
	at org.apache.hadoop.mapred.ClusterMapReduceTestCase.startCluster(ClusterMapReduceTestCase.java:87)
	at org.apache.hadoop.mapred.ClusterMapReduceTestCase.setUp(ClusterMapReduceTestCase.java:56)
	at sun.reflect.NativeMethodAccessorImpl.invoke0(Native Method)
	at sun.reflect.NativeMethodAccessorImpl.invoke(NativeMethodAccessorImpl.java:62)
	at sun.reflect.DelegatingMethodAccessorImpl.invoke(DelegatingMethodAccessorImpl.java:43)
	at java.lang.reflect.Method.invoke(Method.java:483)
	at org.junit.runners.model.FrameworkMethod$1.runReflectiveCall(FrameworkMethod.java:47)
	at org.junit.internal.runners.model.ReflectiveCallable.run(ReflectiveCallable.java:12)
	at org.junit.runners.model.FrameworkMethod.invokeExplosively(FrameworkMethod.java:44)
	at org.junit.internal.runners.statements.RunBefores.evaluate(RunBefores.java:24)
	at org.junit.internal.runners.statements.RunAfters.evaluate(RunAfters.java:27)
	at org.junit.runners.ParentRunner.runLeaf(ParentRunner.java:271)
	at org.junit.runners.BlockJUnit4ClassRunner.runChild(BlockJUnit4ClassRunner.java:70)
	at org.junit.runners.BlockJUnit4ClassRunner.runChild(BlockJUnit4ClassRunner.java:50)
	at org.junit.runners.ParentRunner$3.run(ParentRunner.java:238)
	at org.junit.runners.ParentRunner$1.schedule(ParentRunner.java:63)
	at org.junit.runners.ParentRunner.runChildren(ParentRunner.java:236)
	at org.junit.runners.ParentRunner.access$000(ParentRunner.java:53)
	at org.junit.runners.ParentRunner$2.evaluate(ParentRunner.java:229)
	at org.junit.runners.ParentRunner.run(ParentRunner.java:309)
	at org.apache.maven.surefire.junit4.JUnit4Provider.execute(JUnit4Provider.java:264)
	at org.apache.maven.surefire.junit4.JUnit4Provider.executeTestSet(JUnit4Provider.java:153)
	at org.apache.maven.surefire.junit4.JUnit4Provider.invoke(JUnit4Provider.java:124)
	at org.apache.maven.surefire.booter.ForkedBooter.invokeProviderInSameClassLoader(ForkedBooter.java:200)
	at org.apache.maven.surefire.booter.ForkedBooter.runSuitesInProcess(ForkedBooter.java:153)
	at org.apache.maven.surefire.booter.ForkedBooter.main(ForkedBooter.java:103)
Caused by: java.lang.ClassNotFoundException: org.apache.hadoop.yarn.exceptions.YarnRuntimeException
	at java.net.URLClassLoader$1.run(URLClassLoader.java:372)
	at java.net.URLClassLoader$1.run(URLClassLoader.java:361)
	at java.security.AccessController.doPrivileged(Native Method)
	at java.net.URLClassLoader.findClass(URLClassLoader.java:360)
	at java.lang.ClassLoader.loadClass(ClassLoader.java:424)
	at sun.misc.Launcher$AppClassLoader.loadClass(Launcher.java:308)
	at java.lang.ClassLoader.loadClass(ClassLoader.java:357)
	at org.apache.hadoop.mapred.MiniMRClientClusterFactory.create(MiniMRClientClusterFactory.java:58)
	at org.apache.hadoop.mapred.MiniMRCluster.<init>(MiniMRCluster.java:187)
	at org.apache.hadoop.mapred.MiniMRCluster.<init>(MiniMRCluster.java:175)
	at org.apache.hadoop.mapred.MiniMRCluster.<init>(MiniMRCluster.java:167)
	at org.apache.hadoop.mapred.ClusterMapReduceTestCase$ConfigurableMiniMRCluster.<init>(ClusterMapReduceTestCase.java:101)
	at org.apache.hadoop.mapred.ClusterMapReduceTestCase.startCluster(ClusterMapReduceTestCase.java:87)
	at org.apache.hadoop.mapred.ClusterMapReduceTestCase.setUp(ClusterMapReduceTestCase.java:56)
	at sun.reflect.NativeMethodAccessorImpl.invoke0(Native Method)
	at sun.reflect.NativeMethodAccessorImpl.invoke(NativeMethodAccessorImpl.java:62)
	at sun.reflect.DelegatingMethodAccessorImpl.invoke(DelegatingMethodAccessorImpl.java:43)
	at java.lang.reflect.Method.invoke(Method.java:483)
	at org.junit.runners.model.FrameworkMethod$1.runReflectiveCall(FrameworkMethod.java:47)
	at org.junit.internal.runners.model.ReflectiveCallable.run(ReflectiveCallable.java:12)
	at org.junit.runners.model.FrameworkMethod.invokeExplosively(FrameworkMethod.java:44)
	at org.junit.internal.runners.statements.RunBefores.evaluate(RunBefores.java:24)
	at org.junit.internal.runners.statements.RunAfters.evaluate(RunAfters.java:27)
	at org.junit.runners.ParentRunner.runLeaf(ParentRunner.java:271)
	at org.junit.runners.BlockJUnit4ClassRunner.runChild(BlockJUnit4ClassRunner.java:70)
	at org.junit.runners.BlockJUnit4ClassRunner.runChild(BlockJUnit4ClassRunner.java:50)
	at org.junit.runners.ParentRunner$3.run(ParentRunner.java:238)
	at org.junit.runners.ParentRunner$1.schedule(ParentRunner.java:63)
	at org.junit.runners.ParentRunner.runChildren(ParentRunner.java:236)
	at org.junit.runners.ParentRunner.access$000(ParentRunner.java:53)
	at org.junit.runners.ParentRunner$2.evaluate(ParentRunner.java:229)
	at org.junit.runners.ParentRunner.run(ParentRunner.java:309)
	at org.apache.maven.surefire.junit4.JUnit4Provider.execute(JUnit4Provider.java:264)
	at org.apache.maven.surefire.junit4.JUnit4Provider.executeTestSet(JUnit4Provider.java:153)
	at org.apache.maven.surefire.junit4.JUnit4Provider.invoke(JUnit4Provider.java:124)
	at org.apache.maven.surefire.booter.ForkedBooter.invokeProviderInSameClassLoader(ForkedBooter.java:200)
	at org.apache.maven.surefire.booter.ForkedBooter.runSuitesInProcess(ForkedBooter.java:153)
	at org.apache.maven.surefire.booter.ForkedBooter.main(ForkedBooter.java:103)


FAILED:  org.apache.hadoop.mapred.TestClusterMapReduceTestCase.testMRConfig

Error Message:
org/apache/hadoop/yarn/exceptions/YarnRuntimeException

Stack Trace:
java.lang.NoClassDefFoundError: org/apache/hadoop/yarn/exceptions/YarnRuntimeException
	at org.apache.hadoop.mapred.MiniMRClientClusterFactory.create(MiniMRClientClusterFactory.java:58)
	at org.apache.hadoop.mapred.MiniMRCluster.<init>(MiniMRCluster.java:187)
	at org.apache.hadoop.mapred.MiniMRCluster.<init>(MiniMRCluster.java:175)
	at org.apache.hadoop.mapred.MiniMRCluster.<init>(MiniMRCluster.java:167)
	at org.apache.hadoop.mapred.ClusterMapReduceTestCase$ConfigurableMiniMRCluster.<init>(ClusterMapReduceTestCase.java:101)
	at org.apache.hadoop.mapred.ClusterMapReduceTestCase.startCluster(ClusterMapReduceTestCase.java:87)
	at org.apache.hadoop.mapred.ClusterMapReduceTestCase.setUp(ClusterMapReduceTestCase.java:56)
	at sun.reflect.NativeMethodAccessorImpl.invoke0(Native Method)
	at sun.reflect.NativeMethodAccessorImpl.invoke(NativeMethodAccessorImpl.java:62)
	at sun.reflect.DelegatingMethodAccessorImpl.invoke(DelegatingMethodAccessorImpl.java:43)
	at java.lang.reflect.Method.invoke(Method.java:483)
	at org.junit.runners.model.FrameworkMethod$1.runReflectiveCall(FrameworkMethod.java:47)
	at org.junit.internal.runners.model.ReflectiveCallable.run(ReflectiveCallable.java:12)
	at org.junit.runners.model.FrameworkMethod.invokeExplosively(FrameworkMethod.java:44)
	at org.junit.internal.runners.statements.RunBefores.evaluate(RunBefores.java:24)
	at org.junit.internal.runners.statements.RunAfters.evaluate(RunAfters.java:27)
	at org.junit.runners.ParentRunner.runLeaf(ParentRunner.java:271)
	at org.junit.runners.BlockJUnit4ClassRunner.runChild(BlockJUnit4ClassRunner.java:70)
	at org.junit.runners.BlockJUnit4ClassRunner.runChild(BlockJUnit4ClassRunner.java:50)
	at org.junit.runners.ParentRunner$3.run(ParentRunner.java:238)
	at org.junit.runners.ParentRunner$1.schedule(ParentRunner.java:63)
	at org.junit.runners.ParentRunner.runChildren(ParentRunner.java:236)
	at org.junit.runners.ParentRunner.access$000(ParentRunner.java:53)
	at org.junit.runners.ParentRunner$2.evaluate(ParentRunner.java:229)
	at org.junit.runners.ParentRunner.run(ParentRunner.java:309)
	at org.apache.maven.surefire.junit4.JUnit4Provider.execute(JUnit4Provider.java:264)
	at org.apache.maven.surefire.junit4.JUnit4Provider.executeTestSet(JUnit4Provider.java:153)
	at org.apache.maven.surefire.junit4.JUnit4Provider.invoke(JUnit4Provider.java:124)
	at org.apache.maven.surefire.booter.ForkedBooter.invokeProviderInSameClassLoader(ForkedBooter.java:200)
	at org.apache.maven.surefire.booter.ForkedBooter.runSuitesInProcess(ForkedBooter.java:153)
	at org.apache.maven.surefire.booter.ForkedBooter.main(ForkedBooter.java:103)
Caused by: java.lang.ClassNotFoundException: org.apache.hadoop.yarn.exceptions.YarnRuntimeException
	at java.net.URLClassLoader$1.run(URLClassLoader.java:372)
	at java.net.URLClassLoader$1.run(URLClassLoader.java:361)
	at java.security.AccessController.doPrivileged(Native Method)
	at java.net.URLClassLoader.findClass(URLClassLoader.java:360)
	at java.lang.ClassLoader.loadClass(ClassLoader.java:424)
	at sun.misc.Launcher$AppClassLoader.loadClass(Launcher.java:308)
	at java.lang.ClassLoader.loadClass(ClassLoader.java:357)
	at org.apache.hadoop.mapred.MiniMRClientClusterFactory.create(MiniMRClientClusterFactory.java:58)
	at org.apache.hadoop.mapred.MiniMRCluster.<init>(MiniMRCluster.java:187)
	at org.apache.hadoop.mapred.MiniMRCluster.<init>(MiniMRCluster.java:175)
	at org.apache.hadoop.mapred.MiniMRCluster.<init>(MiniMRCluster.java:167)
	at org.apache.hadoop.mapred.ClusterMapReduceTestCase$ConfigurableMiniMRCluster.<init>(ClusterMapReduceTestCase.java:101)
	at org.apache.hadoop.mapred.ClusterMapReduceTestCase.startCluster(ClusterMapReduceTestCase.java:87)
	at org.apache.hadoop.mapred.ClusterMapReduceTestCase.setUp(ClusterMapReduceTestCase.java:56)
	at sun.reflect.NativeMethodAccessorImpl.invoke0(Native Method)
	at sun.reflect.NativeMethodAccessorImpl.invoke(NativeMethodAccessorImpl.java:62)
	at sun.reflect.DelegatingMethodAccessorImpl.invoke(DelegatingMethodAccessorImpl.java:43)
	at java.lang.reflect.Method.invoke(Method.java:483)
	at org.junit.runners.model.FrameworkMethod$1.runReflectiveCall(FrameworkMethod.java:47)
	at org.junit.internal.runners.model.ReflectiveCallable.run(ReflectiveCallable.java:12)
	at org.junit.runners.model.FrameworkMethod.invokeExplosively(FrameworkMethod.java:44)
	at org.junit.internal.runners.statements.RunBefores.evaluate(RunBefores.java:24)
	at org.junit.internal.runners.statements.RunAfters.evaluate(RunAfters.java:27)
	at org.junit.runners.ParentRunner.runLeaf(ParentRunner.java:271)
	at org.junit.runners.BlockJUnit4ClassRunner.runChild(BlockJUnit4ClassRunner.java:70)
	at org.junit.runners.BlockJUnit4ClassRunner.runChild(BlockJUnit4ClassRunner.java:50)
	at org.junit.runners.ParentRunner$3.run(ParentRunner.java:238)
	at org.junit.runners.ParentRunner$1.schedule(ParentRunner.java:63)
	at org.junit.runners.ParentRunner.runChildren(ParentRunner.java:236)
	at org.junit.runners.ParentRunner.access$000(ParentRunner.java:53)
	at org.junit.runners.ParentRunner$2.evaluate(ParentRunner.java:229)
	at org.junit.runners.ParentRunner.run(ParentRunner.java:309)
	at org.apache.maven.surefire.junit4.JUnit4Provider.execute(JUnit4Provider.java:264)
	at org.apache.maven.surefire.junit4.JUnit4Provider.executeTestSet(JUnit4Provider.java:153)
	at org.apache.maven.surefire.junit4.JUnit4Provider.invoke(JUnit4Provider.java:124)
	at org.apache.maven.surefire.booter.ForkedBooter.invokeProviderInSameClassLoader(ForkedBooter.java:200)
	at org.apache.maven.surefire.booter.ForkedBooter.runSuitesInProcess(ForkedBooter.java:153)
	at org.apache.maven.surefire.booter.ForkedBooter.main(ForkedBooter.java:103)


FAILED:  org.apache.hadoop.mapred.TestClusterMapReduceTestCase.testDFSRestart

Error Message:
org/apache/hadoop/yarn/exceptions/YarnRuntimeException

Stack Trace:
java.lang.NoClassDefFoundError: org/apache/hadoop/yarn/exceptions/YarnRuntimeException
	at org.apache.hadoop.mapred.MiniMRClientClusterFactory.create(MiniMRClientClusterFactory.java:58)
	at org.apache.hadoop.mapred.MiniMRCluster.<init>(MiniMRCluster.java:187)
	at org.apache.hadoop.mapred.MiniMRCluster.<init>(MiniMRCluster.java:175)
	at org.apache.hadoop.mapred.MiniMRCluster.<init>(MiniMRCluster.java:167)
	at org.apache.hadoop.mapred.ClusterMapReduceTestCase$ConfigurableMiniMRCluster.<init>(ClusterMapReduceTestCase.java:101)
	at org.apache.hadoop.mapred.ClusterMapReduceTestCase.startCluster(ClusterMapReduceTestCase.java:87)
	at org.apache.hadoop.mapred.ClusterMapReduceTestCase.setUp(ClusterMapReduceTestCase.java:56)
	at sun.reflect.NativeMethodAccessorImpl.invoke0(Native Method)
	at sun.reflect.NativeMethodAccessorImpl.invoke(NativeMethodAccessorImpl.java:62)
	at sun.reflect.DelegatingMethodAccessorImpl.invoke(DelegatingMethodAccessorImpl.java:43)
	at java.lang.reflect.Method.invoke(Method.java:483)
	at org.junit.runners.model.FrameworkMethod$1.runReflectiveCall(FrameworkMethod.java:47)
	at org.junit.internal.runners.model.ReflectiveCallable.run(ReflectiveCallable.java:12)
	at org.junit.runners.model.FrameworkMethod.invokeExplosively(FrameworkMethod.java:44)
	at org.junit.internal.runners.statements.RunBefores.evaluate(RunBefores.java:24)
	at org.junit.internal.runners.statements.RunAfters.evaluate(RunAfters.java:27)
	at org.junit.runners.ParentRunner.runLeaf(ParentRunner.java:271)
	at org.junit.runners.BlockJUnit4ClassRunner.runChild(BlockJUnit4ClassRunner.java:70)
	at org.junit.runners.BlockJUnit4ClassRunner.runChild(BlockJUnit4ClassRunner.java:50)
	at org.junit.runners.ParentRunner$3.run(ParentRunner.java:238)
	at org.junit.runners.ParentRunner$1.schedule(ParentRunner.java:63)
	at org.junit.runners.ParentRunner.runChildren(ParentRunner.java:236)
	at org.junit.runners.ParentRunner.access$000(ParentRunner.java:53)
	at org.junit.runners.ParentRunner$2.evaluate(ParentRunner.java:229)
	at org.junit.runners.ParentRunner.run(ParentRunner.java:309)
	at org.apache.maven.surefire.junit4.JUnit4Provider.execute(JUnit4Provider.java:264)
	at org.apache.maven.surefire.junit4.JUnit4Provider.executeTestSet(JUnit4Provider.java:153)
	at org.apache.maven.surefire.junit4.JUnit4Provider.invoke(JUnit4Provider.java:124)
	at org.apache.maven.surefire.booter.ForkedBooter.invokeProviderInSameClassLoader(ForkedBooter.java:200)
	at org.apache.maven.surefire.booter.ForkedBooter.runSuitesInProcess(ForkedBooter.java:153)
	at org.apache.maven.surefire.booter.ForkedBooter.main(ForkedBooter.java:103)
Caused by: java.lang.ClassNotFoundException: org.apache.hadoop.yarn.exceptions.YarnRuntimeException
	at java.net.URLClassLoader$1.run(URLClassLoader.java:372)
	at java.net.URLClassLoader$1.run(URLClassLoader.java:361)
	at java.security.AccessController.doPrivileged(Native Method)
	at java.net.URLClassLoader.findClass(URLClassLoader.java:360)
	at java.lang.ClassLoader.loadClass(ClassLoader.java:424)
	at sun.misc.Launcher$AppClassLoader.loadClass(Launcher.java:308)
	at java.lang.ClassLoader.loadClass(ClassLoader.java:357)
	at org.apache.hadoop.mapred.MiniMRClientClusterFactory.create(MiniMRClientClusterFactory.java:58)
	at org.apache.hadoop.mapred.MiniMRCluster.<init>(MiniMRCluster.java:187)
	at org.apache.hadoop.mapred.MiniMRCluster.<init>(MiniMRCluster.java:175)
	at org.apache.hadoop.mapred.MiniMRCluster.<init>(MiniMRCluster.java:167)
	at org.apache.hadoop.mapred.ClusterMapReduceTestCase$ConfigurableMiniMRCluster.<init>(ClusterMapReduceTestCase.java:101)
	at org.apache.hadoop.mapred.ClusterMapReduceTestCase.startCluster(ClusterMapReduceTestCase.java:87)
	at org.apache.hadoop.mapred.ClusterMapReduceTestCase.setUp(ClusterMapReduceTestCase.java:56)
	at sun.reflect.NativeMethodAccessorImpl.invoke0(Native Method)
	at sun.reflect.NativeMethodAccessorImpl.invoke(NativeMethodAccessorImpl.java:62)
	at sun.reflect.DelegatingMethodAccessorImpl.invoke(DelegatingMethodAccessorImpl.java:43)
	at java.lang.reflect.Method.invoke(Method.java:483)
	at org.junit.runners.model.FrameworkMethod$1.runReflectiveCall(FrameworkMethod.java:47)
	at org.junit.internal.runners.model.ReflectiveCallable.run(ReflectiveCallable.java:12)
	at org.junit.runners.model.FrameworkMethod.invokeExplosively(FrameworkMethod.java:44)
	at org.junit.internal.runners.statements.RunBefores.evaluate(RunBefores.java:24)
	at org.junit.internal.runners.statements.RunAfters.evaluate(RunAfters.java:27)
	at org.junit.runners.ParentRunner.runLeaf(ParentRunner.java:271)
	at org.junit.runners.BlockJUnit4ClassRunner.runChild(BlockJUnit4ClassRunner.java:70)
	at org.junit.runners.BlockJUnit4ClassRunner.runChild(BlockJUnit4ClassRunner.java:50)
	at org.junit.runners.ParentRunner$3.run(ParentRunner.java:238)
	at org.junit.runners.ParentRunner$1.schedule(ParentRunner.java:63)
	at org.junit.runners.ParentRunner.runChildren(ParentRunner.java:236)
	at org.junit.runners.ParentRunner.access$000(ParentRunner.java:53)
	at org.junit.runners.ParentRunner$2.evaluate(ParentRunner.java:229)
	at org.junit.runners.ParentRunner.run(ParentRunner.java:309)
	at org.apache.maven.surefire.junit4.JUnit4Provider.execute(JUnit4Provider.java:264)
	at org.apache.maven.surefire.junit4.JUnit4Provider.executeTestSet(JUnit4Provider.java:153)
	at org.apache.maven.surefire.junit4.JUnit4Provider.invoke(JUnit4Provider.java:124)
	at org.apache.maven.surefire.booter.ForkedBooter.invokeProviderInSameClassLoader(ForkedBooter.java:200)
	at org.apache.maven.surefire.booter.ForkedBooter.runSuitesInProcess(ForkedBooter.java:153)
	at org.apache.maven.surefire.booter.ForkedBooter.main(ForkedBooter.java:103)


FAILED:  org.apache.hadoop.mapred.TestClusterMapReduceTestCase.testMapReduce

Error Message:
org/apache/hadoop/yarn/exceptions/YarnRuntimeException

Stack Trace:
java.lang.NoClassDefFoundError: org/apache/hadoop/yarn/exceptions/YarnRuntimeException
	at org.apache.hadoop.mapred.MiniMRClientClusterFactory.create(MiniMRClientClusterFactory.java:58)
	at org.apache.hadoop.mapred.MiniMRCluster.<init>(MiniMRCluster.java:187)
	at org.apache.hadoop.mapred.MiniMRCluster.<init>(MiniMRCluster.java:175)
	at org.apache.hadoop.mapred.MiniMRCluster.<init>(MiniMRCluster.java:167)
	at org.apache.hadoop.mapred.ClusterMapReduceTestCase$ConfigurableMiniMRCluster.<init>(ClusterMapReduceTestCase.java:101)
	at org.apache.hadoop.mapred.ClusterMapReduceTestCase.startCluster(ClusterMapReduceTestCase.java:87)
	at org.apache.hadoop.mapred.ClusterMapReduceTestCase.setUp(ClusterMapReduceTestCase.java:56)
	at sun.reflect.NativeMethodAccessorImpl.invoke0(Native Method)
	at sun.reflect.NativeMethodAccessorImpl.invoke(NativeMethodAccessorImpl.java:62)
	at sun.reflect.DelegatingMethodAccessorImpl.invoke(DelegatingMethodAccessorImpl.java:43)
	at java.lang.reflect.Method.invoke(Method.java:483)
	at org.junit.runners.model.FrameworkMethod$1.runReflectiveCall(FrameworkMethod.java:47)
	at org.junit.internal.runners.model.ReflectiveCallable.run(ReflectiveCallable.java:12)
	at org.junit.runners.model.FrameworkMethod.invokeExplosively(FrameworkMethod.java:44)
	at org.junit.internal.runners.statements.RunBefores.evaluate(RunBefores.java:24)
	at org.junit.internal.runners.statements.RunAfters.evaluate(RunAfters.java:27)
	at org.junit.runners.ParentRunner.runLeaf(ParentRunner.java:271)
	at org.junit.runners.BlockJUnit4ClassRunner.runChild(BlockJUnit4ClassRunner.java:70)
	at org.junit.runners.BlockJUnit4ClassRunner.runChild(BlockJUnit4ClassRunner.java:50)
	at org.junit.runners.ParentRunner$3.run(ParentRunner.java:238)
	at org.junit.runners.ParentRunner$1.schedule(ParentRunner.java:63)
	at org.junit.runners.ParentRunner.runChildren(ParentRunner.java:236)
	at org.junit.runners.ParentRunner.access$000(ParentRunner.java:53)
	at org.junit.runners.ParentRunner$2.evaluate(ParentRunner.java:229)
	at org.junit.runners.ParentRunner.run(ParentRunner.java:309)
	at org.apache.maven.surefire.junit4.JUnit4Provider.execute(JUnit4Provider.java:264)
	at org.apache.maven.surefire.junit4.JUnit4Provider.executeTestSet(JUnit4Provider.java:153)
	at org.apache.maven.surefire.junit4.JUnit4Provider.invoke(JUnit4Provider.java:124)
	at org.apache.maven.surefire.booter.ForkedBooter.invokeProviderInSameClassLoader(ForkedBooter.java:200)
	at org.apache.maven.surefire.booter.ForkedBooter.runSuitesInProcess(ForkedBooter.java:153)
	at org.apache.maven.surefire.booter.ForkedBooter.main(ForkedBooter.java:103)
Caused by: java.lang.ClassNotFoundException: org.apache.hadoop.yarn.exceptions.YarnRuntimeException
	at java.net.URLClassLoader$1.run(URLClassLoader.java:372)
	at java.net.URLClassLoader$1.run(URLClassLoader.java:361)
	at java.security.AccessController.doPrivileged(Native Method)
	at java.net.URLClassLoader.findClass(URLClassLoader.java:360)
	at java.lang.ClassLoader.loadClass(ClassLoader.java:424)
	at sun.misc.Launcher$AppClassLoader.loadClass(Launcher.java:308)
	at java.lang.ClassLoader.loadClass(ClassLoader.java:357)
	at org.apache.hadoop.mapred.MiniMRClientClusterFactory.create(MiniMRClientClusterFactory.java:58)
	at org.apache.hadoop.mapred.MiniMRCluster.<init>(MiniMRCluster.java:187)
	at org.apache.hadoop.mapred.MiniMRCluster.<init>(MiniMRCluster.java:175)
	at org.apache.hadoop.mapred.MiniMRCluster.<init>(MiniMRCluster.java:167)
	at org.apache.hadoop.mapred.ClusterMapReduceTestCase$ConfigurableMiniMRCluster.<init>(ClusterMapReduceTestCase.java:101)
	at org.apache.hadoop.mapred.ClusterMapReduceTestCase.startCluster(ClusterMapReduceTestCase.java:87)
	at org.apache.hadoop.mapred.ClusterMapReduceTestCase.setUp(ClusterMapReduceTestCase.java:56)
	at sun.reflect.NativeMethodAccessorImpl.invoke0(Native Method)
	at sun.reflect.NativeMethodAccessorImpl.invoke(NativeMethodAccessorImpl.java:62)
	at sun.reflect.DelegatingMethodAccessorImpl.invoke(DelegatingMethodAccessorImpl.java:43)
	at java.lang.reflect.Method.invoke(Method.java:483)
	at org.junit.runners.model.FrameworkMethod$1.runReflectiveCall(FrameworkMethod.java:47)
	at org.junit.internal.runners.model.ReflectiveCallable.run(ReflectiveCallable.java:12)
	at org.junit.runners.model.FrameworkMethod.invokeExplosively(FrameworkMethod.java:44)
	at org.junit.internal.runners.statements.RunBefores.evaluate(RunBefores.java:24)
	at org.junit.internal.runners.statements.RunAfters.evaluate(RunAfters.java:27)
	at org.junit.runners.ParentRunner.runLeaf(ParentRunner.java:271)
	at org.junit.runners.BlockJUnit4ClassRunner.runChild(BlockJUnit4ClassRunner.java:70)
	at org.junit.runners.BlockJUnit4ClassRunner.runChild(BlockJUnit4ClassRunner.java:50)
	at org.junit.runners.ParentRunner$3.run(ParentRunner.java:238)
	at org.junit.runners.ParentRunner$1.schedule(ParentRunner.java:63)
	at org.junit.runners.ParentRunner.runChildren(ParentRunner.java:236)
	at org.junit.runners.ParentRunner.access$000(ParentRunner.java:53)
	at org.junit.runners.ParentRunner$2.evaluate(ParentRunner.java:229)
	at org.junit.runners.ParentRunner.run(ParentRunner.java:309)
	at org.apache.maven.surefire.junit4.JUnit4Provider.execute(JUnit4Provider.java:264)
	at org.apache.maven.surefire.junit4.JUnit4Provider.executeTestSet(JUnit4Provider.java:153)
	at org.apache.maven.surefire.junit4.JUnit4Provider.invoke(JUnit4Provider.java:124)
	at org.apache.maven.surefire.booter.ForkedBooter.invokeProviderInSameClassLoader(ForkedBooter.java:200)
	at org.apache.maven.surefire.booter.ForkedBooter.runSuitesInProcess(ForkedBooter.java:153)
	at org.apache.maven.surefire.booter.ForkedBooter.main(ForkedBooter.java:103)


FAILED:  org.apache.hadoop.mapred.TestMerge.testMerge

Error Message:
org/apache/hadoop/hdfs/server/namenode/JournalSet$5

Stack Trace:
java.lang.NoClassDefFoundError: org/apache/hadoop/hdfs/server/namenode/JournalSet$5
	at org.apache.hadoop.hdfs.server.namenode.JournalSet.close(JournalSet.java:243)
	at org.apache.hadoop.hdfs.server.namenode.FSEditLog.close(FSEditLog.java:375)
	at org.apache.hadoop.hdfs.server.namenode.FSNamesystem.stopActiveServices(FSNamesystem.java:1203)
	at org.apache.hadoop.hdfs.server.namenode.FSNamesystem.close(FSNamesystem.java:1559)
	at org.apache.hadoop.hdfs.server.namenode.NameNode.stopCommonServices(NameNode.java:790)
	at org.apache.hadoop.hdfs.server.namenode.NameNode.stop(NameNode.java:969)
	at org.apache.hadoop.hdfs.MiniDFSCluster.stopAndJoinNameNode(MiniDFSCluster.java:1965)
	at org.apache.hadoop.hdfs.MiniDFSCluster.shutdown(MiniDFSCluster.java:1911)
	at org.apache.hadoop.hdfs.MiniDFSCluster.shutdown(MiniDFSCluster.java:1882)
	at org.apache.hadoop.hdfs.MiniDFSCluster.shutdown(MiniDFSCluster.java:1875)
	at org.apache.hadoop.mapred.TestMerge.testMerge(TestMerge.java:91)


FAILED:  org.apache.hadoop.mapred.TestMiniMRBringup.testBringUp

Error Message:
org.apache.hadoop.yarn.webapp.WebAppException: Error starting http server

Stack Trace:
org.apache.hadoop.yarn.exceptions.YarnRuntimeException: org.apache.hadoop.yarn.webapp.WebAppException:
Error starting http server
	at org.apache.hadoop.http.HttpServer2.start(HttpServer2.java:875)
	at org.apache.hadoop.yarn.webapp.WebApps$Builder.start(WebApps.java:348)
	at org.apache.hadoop.yarn.server.resourcemanager.ResourceManager.startWepApp(ResourceManager.java:1078)
	at org.apache.hadoop.yarn.server.resourcemanager.ResourceManager.serviceStart(ResourceManager.java:1176)
	at org.apache.hadoop.service.AbstractService.start(AbstractService.java:193)
	at org.apache.hadoop.yarn.server.MiniYARNCluster.startResourceManager(MiniYARNCluster.java:335)
	at org.apache.hadoop.yarn.server.MiniYARNCluster.access$300(MiniYARNCluster.java:112)
	at org.apache.hadoop.yarn.server.MiniYARNCluster$ResourceManagerWrapper.serviceStart(MiniYARNCluster.java:464)
	at org.apache.hadoop.service.AbstractService.start(AbstractService.java:193)
	at org.apache.hadoop.service.CompositeService.serviceStart(CompositeService.java:120)
	at org.apache.hadoop.yarn.server.MiniYARNCluster.serviceStart(MiniYARNCluster.java:292)
	at org.apache.hadoop.mapreduce.v2.MiniMRYarnCluster.serviceStart(MiniMRYarnCluster.java:191)
	at org.apache.hadoop.service.AbstractService.start(AbstractService.java:193)
	at org.apache.hadoop.mapred.MiniMRClientClusterFactory.create(MiniMRClientClusterFactory.java:80)
	at org.apache.hadoop.mapred.MiniMRCluster.<init>(MiniMRCluster.java:187)
	at org.apache.hadoop.mapred.MiniMRCluster.<init>(MiniMRCluster.java:175)
	at org.apache.hadoop.mapred.MiniMRCluster.<init>(MiniMRCluster.java:167)
	at org.apache.hadoop.mapred.MiniMRCluster.<init>(MiniMRCluster.java:159)
	at org.apache.hadoop.mapred.MiniMRCluster.<init>(MiniMRCluster.java:152)
	at org.apache.hadoop.mapred.MiniMRCluster.<init>(MiniMRCluster.java:145)
	at org.apache.hadoop.mapred.MiniMRCluster.<init>(MiniMRCluster.java:138)
	at org.apache.hadoop.mapred.MiniMRCluster.<init>(MiniMRCluster.java:133)
	at org.apache.hadoop.mapred.TestMiniMRBringup.testBringUp(TestMiniMRBringup.java:34)


FAILED:  org.apache.hadoop.mapred.TestMiniMRChildTask.org.apache.hadoop.mapred.TestMiniMRChildTask

Error Message:
org/apache/hadoop/yarn/server/MiniYARNCluster$CustomNodeManager

Stack Trace:
java.lang.NoClassDefFoundError: org/apache/hadoop/yarn/server/MiniYARNCluster$CustomNodeManager
	at java.net.URLClassLoader$1.run(URLClassLoader.java:372)
	at java.net.URLClassLoader$1.run(URLClassLoader.java:361)
	at java.security.AccessController.doPrivileged(Native Method)
	at java.net.URLClassLoader.findClass(URLClassLoader.java:360)
	at java.lang.ClassLoader.loadClass(ClassLoader.java:424)
	at sun.misc.Launcher$AppClassLoader.loadClass(Launcher.java:308)
	at java.lang.ClassLoader.loadClass(ClassLoader.java:357)
	at org.apache.hadoop.mapred.TestMiniMRChildTask.setup(TestMiniMRChildTask.java:356)


FAILED:  org.apache.hadoop.mapreduce.v2.TestMRJobs.testJobWithChangePriority

Error Message:
expected:<DEFAULT> but was:<HIGH>

Stack Trace:
java.lang.AssertionError: expected:<DEFAULT> but was:<HIGH>
	at org.junit.Assert.fail(Assert.java:88)
	at org.junit.Assert.failNotEquals(Assert.java:743)
	at org.junit.Assert.assertEquals(Assert.java:118)
	at org.junit.Assert.assertEquals(Assert.java:144)
	at org.apache.hadoop.mapreduce.v2.TestMRJobs.testJobWithChangePriority(TestMRJobs.java:276)


FAILED:  org.apache.hadoop.mapreduce.v2.TestUberAM.testJobWithChangePriority

Error Message:
expected:<DEFAULT> but was:<HIGH>

Stack Trace:
java.lang.AssertionError: expected:<DEFAULT> but was:<HIGH>
	at org.junit.Assert.fail(Assert.java:88)
	at org.junit.Assert.failNotEquals(Assert.java:743)
	at org.junit.Assert.assertEquals(Assert.java:118)
	at org.junit.Assert.assertEquals(Assert.java:144)
	at org.apache.hadoop.mapreduce.v2.TestMRJobs.testJobWithChangePriority(TestMRJobs.java:276)
	at sun.reflect.NativeMethodAccessorImpl.invoke0(Native Method)
	at sun.reflect.NativeMethodAccessorImpl.invoke(NativeMethodAccessorImpl.java:62)
	at sun.reflect.DelegatingMethodAccessorImpl.invoke(DelegatingMethodAccessorImpl.java:43)
	at java.lang.reflect.Method.invoke(Method.java:483)
	at org.junit.runners.model.FrameworkMethod$1.runReflectiveCall(FrameworkMethod.java:47)
	at org.junit.internal.runners.model.ReflectiveCallable.run(ReflectiveCallable.java:12)
	at org.junit.runners.model.FrameworkMethod.invokeExplosively(FrameworkMethod.java:44)
	at org.junit.internal.runners.statements.InvokeMethod.evaluate(InvokeMethod.java:17)
	at org.junit.internal.runners.statements.FailOnTimeout$StatementThread.run(FailOnTimeout.java:74)



Mime
  • Unnamed multipart/mixed (inline, None, 0 bytes)
View raw message