hadoop-mapreduce-dev mailing list archives

Site index · List index
Message view « Date » · « Thread »
Top « Date » · « Thread »
From Apache Jenkins Server <jenk...@builds.apache.org>
Subject Hadoop-Mapreduce-trunk-Java8 - Build # 1311 - Still Failing
Date Fri, 22 Apr 2016 11:33:00 GMT
See https://builds.apache.org/job/Hadoop-Mapreduce-trunk-Java8/1311/

###################################################################################
########################## LAST 60 LINES OF THE CONSOLE ###########################
[...truncated 8855 lines...]
Running org.apache.hadoop.mapreduce.v2.app.TestMRApp
Tests run: 13, Failures: 0, Errors: 0, Skipped: 0, Time elapsed: 22.96 sec - in org.apache.hadoop.mapreduce.v2.app.TestMRApp
Java HotSpot(TM) 64-Bit Server VM warning: ignoring option MaxPermSize=768m; support was removed
in 8.0
Running org.apache.hadoop.mapred.TestTaskAttemptFinishingMonitor
Tests run: 1, Failures: 0, Errors: 0, Skipped: 0, Time elapsed: 1.282 sec - in org.apache.hadoop.mapred.TestTaskAttemptFinishingMonitor
Java HotSpot(TM) 64-Bit Server VM warning: ignoring option MaxPermSize=768m; support was removed
in 8.0
Running org.apache.hadoop.mapred.TestTaskAttemptListenerImpl
Tests run: 6, Failures: 0, Errors: 0, Skipped: 0, Time elapsed: 0.987 sec - in org.apache.hadoop.mapred.TestTaskAttemptListenerImpl
Java HotSpot(TM) 64-Bit Server VM warning: ignoring option MaxPermSize=768m; support was removed
in 8.0
Running org.apache.hadoop.mapred.TestLocalContainerLauncher
Tests run: 2, Failures: 0, Errors: 0, Skipped: 0, Time elapsed: 1.684 sec - in org.apache.hadoop.mapred.TestLocalContainerLauncher

Results :

Tests in error: 
  TestRMContainerAllocator.testRMContainerAllocatorResendsRequestsOnRMRestart:2535 ยป IllegalState

Tests run: 344, Failures: 0, Errors: 1, Skipped: 0

[INFO] ------------------------------------------------------------------------
[INFO] Reactor Summary:
[INFO] 
[INFO] Apache Hadoop MapReduce Client .................... SUCCESS [  2.265 s]
[INFO] Apache Hadoop MapReduce Core ...................... SUCCESS [01:40 min]
[INFO] Apache Hadoop MapReduce Common .................... SUCCESS [ 24.708 s]
[INFO] Apache Hadoop MapReduce Shuffle ................... SUCCESS [  4.332 s]
[INFO] Apache Hadoop MapReduce App ....................... FAILURE [10:56 min]
[INFO] Apache Hadoop MapReduce HistoryServer ............. SKIPPED
[INFO] Apache Hadoop MapReduce JobClient ................. SKIPPED
[INFO] Apache Hadoop MapReduce HistoryServer Plugins ..... SKIPPED
[INFO] Apache Hadoop MapReduce NativeTask ................ SKIPPED
[INFO] Apache Hadoop MapReduce Examples .................. SKIPPED
[INFO] Apache Hadoop MapReduce ........................... SKIPPED
[INFO] ------------------------------------------------------------------------
[INFO] BUILD FAILURE
[INFO] ------------------------------------------------------------------------
[INFO] Total time: 13:09 min
[INFO] Finished at: 2016-04-22T11:32:58+00:00
[INFO] Final Memory: 36M/245M
[INFO] ------------------------------------------------------------------------
[ERROR] Failed to execute goal org.apache.maven.plugins:maven-surefire-plugin:2.17:test (default-test)
on project hadoop-mapreduce-client-app: There are test failures.
[ERROR] 
[ERROR] Please refer to /home/jenkins/jenkins-slave/workspace/Hadoop-Mapreduce-trunk-Java8/hadoop-mapreduce-project/hadoop-mapreduce-client/hadoop-mapreduce-client-app/target/surefire-reports
for the individual test results.
[ERROR] -> [Help 1]
[ERROR] 
[ERROR] To see the full stack trace of the errors, re-run Maven with the -e switch.
[ERROR] Re-run Maven using the -X switch to enable full debug logging.
[ERROR] 
[ERROR] For more information about the errors and possible solutions, please read the following
articles:
[ERROR] [Help 1] http://cwiki.apache.org/confluence/display/MAVEN/MojoFailureException
[ERROR] 
[ERROR] After correcting the problems, you can resume the build with the command
[ERROR]   mvn <goals> -rf :hadoop-mapreduce-client-app
Build step 'Execute shell' marked build as failure
[FINDBUGS] Skipping publisher since build result is FAILURE
Archiving artifacts
Recording test results
Email was triggered for: Failure - Any
Sending email for trigger: Failure - Any



###################################################################################
############################## FAILED TESTS (if any) ##############################
1 tests failed.
FAILED:  org.apache.hadoop.mapreduce.v2.app.rm.TestRMContainerAllocator.testRMContainerAllocatorResendsRequestsOnRMRestart

Error Message:
InputStream#read(byte[]) returned invalid result: 0
The InputStream implementation is buggy.

Stack Trace:
java.lang.IllegalStateException: InputStream#read(byte[]) returned invalid result: 0
The InputStream implementation is buggy.
	at com.google.protobuf.CodedInputStream.refillBuffer(CodedInputStream.java:739)
	at com.google.protobuf.CodedInputStream.isAtEnd(CodedInputStream.java:701)
	at com.google.protobuf.CodedInputStream.readTag(CodedInputStream.java:99)
	at org.apache.hadoop.security.proto.SecurityProtos$CredentialsProto.<init>(SecurityProtos.java:1828)
	at org.apache.hadoop.security.proto.SecurityProtos$CredentialsProto.<init>(SecurityProtos.java:1792)
	at org.apache.hadoop.security.proto.SecurityProtos$CredentialsProto$1.parsePartialFrom(SecurityProtos.java:1892)
	at org.apache.hadoop.security.proto.SecurityProtos$CredentialsProto$1.parsePartialFrom(SecurityProtos.java:1887)
	at com.google.protobuf.AbstractParser.parsePartialFrom(AbstractParser.java:200)
	at com.google.protobuf.AbstractParser.parseFrom(AbstractParser.java:217)
	at com.google.protobuf.AbstractParser.parseFrom(AbstractParser.java:223)
	at com.google.protobuf.AbstractParser.parseFrom(AbstractParser.java:49)
	at org.apache.hadoop.security.proto.SecurityProtos$CredentialsProto.parseFrom(SecurityProtos.java:2100)
	at org.apache.hadoop.security.Credentials.readProtos(Credentials.java:331)
	at org.apache.hadoop.security.Credentials.readTokenStorageStream(Credentials.java:226)
	at org.apache.hadoop.yarn.server.resourcemanager.recovery.records.impl.pb.ApplicationAttemptStateDataPBImpl.convertCredentialsFromByteBuffer(ApplicationAttemptStateDataPBImpl.java:372)
	at org.apache.hadoop.yarn.server.resourcemanager.recovery.records.impl.pb.ApplicationAttemptStateDataPBImpl.getAppAttemptTokens(ApplicationAttemptStateDataPBImpl.java:152)
	at org.apache.hadoop.yarn.server.resourcemanager.rmapp.attempt.RMAppAttemptImpl.recover(RMAppAttemptImpl.java:914)
	at org.apache.hadoop.yarn.server.resourcemanager.rmapp.RMAppImpl.recover(RMAppImpl.java:858)
	at org.apache.hadoop.yarn.server.resourcemanager.rmapp.RMAppImpl$RMAppRecoveredTransition.transition(RMAppImpl.java:998)
	at org.apache.hadoop.yarn.server.resourcemanager.rmapp.RMAppImpl$RMAppRecoveredTransition.transition(RMAppImpl.java:991)
	at org.apache.hadoop.yarn.state.StateMachineFactory$MultipleInternalArc.doTransition(StateMachineFactory.java:385)
	at org.apache.hadoop.yarn.state.StateMachineFactory.doTransition(StateMachineFactory.java:302)
	at org.apache.hadoop.yarn.state.StateMachineFactory.access$300(StateMachineFactory.java:46)
	at org.apache.hadoop.yarn.state.StateMachineFactory$InternalStateMachine.doTransition(StateMachineFactory.java:448)
	at org.apache.hadoop.yarn.server.resourcemanager.rmapp.RMAppImpl.handle(RMAppImpl.java:816)
	at org.apache.hadoop.yarn.server.resourcemanager.RMAppManager.recoverApplication(RMAppManager.java:331)
	at org.apache.hadoop.yarn.server.resourcemanager.RMAppManager.recover(RMAppManager.java:477)
	at org.apache.hadoop.yarn.server.resourcemanager.ResourceManager.recover(ResourceManager.java:1310)
	at org.apache.hadoop.yarn.server.resourcemanager.ResourceManager$RMActiveServices.serviceStart(ResourceManager.java:665)
	at org.apache.hadoop.service.AbstractService.start(AbstractService.java:193)
	at org.apache.hadoop.yarn.server.resourcemanager.ResourceManager.startActiveServices(ResourceManager.java:1097)
	at org.apache.hadoop.yarn.server.resourcemanager.ResourceManager$1.run(ResourceManager.java:1137)
	at org.apache.hadoop.yarn.server.resourcemanager.ResourceManager$1.run(ResourceManager.java:1133)
	at java.security.AccessController.doPrivileged(Native Method)
	at javax.security.auth.Subject.doAs(Subject.java:422)
	at org.apache.hadoop.security.UserGroupInformation.doAs(UserGroupInformation.java:1742)
	at org.apache.hadoop.yarn.server.resourcemanager.ResourceManager.transitionToActive(ResourceManager.java:1133)
	at org.apache.hadoop.yarn.server.resourcemanager.ResourceManager.serviceStart(ResourceManager.java:1173)
	at org.apache.hadoop.mapreduce.v2.app.rm.TestRMContainerAllocator$MyResourceManager.serviceStart(TestRMContainerAllocator.java:855)
	at org.apache.hadoop.service.AbstractService.start(AbstractService.java:193)
	at org.apache.hadoop.mapreduce.v2.app.rm.TestRMContainerAllocator.testRMContainerAllocatorResendsRequestsOnRMRestart(TestRMContainerAllocator.java:2535)



Mime
  • Unnamed multipart/mixed (inline, None, 0 bytes)
View raw message