hadoop-mapreduce-dev mailing list archives

Site index · List index
Message view « Date » · « Thread »
Top « Date » · « Thread »
From Apache Jenkins Server <jenk...@builds.apache.org>
Subject Hadoop-Mapreduce-trunk - Build # 3174 - Still Failing
Date Fri, 08 Apr 2016 16:46:56 GMT
See https://builds.apache.org/job/Hadoop-Mapreduce-trunk/3174/

###################################################################################
########################## LAST 60 LINES OF THE CONSOLE ###########################
[...truncated 6578 lines...]
+-org.apache.hadoop:hadoop-mapreduce-client-app:3.0.0-SNAPSHOT
  +-org.apache.hadoop:hadoop-yarn-server-resourcemanager:3.0.0-20160408.161445-5167
and
+-org.apache.hadoop:hadoop-mapreduce-client-app:3.0.0-SNAPSHOT
  +-org.apache.hadoop:hadoop-yarn-server-resourcemanager:3.0.0-20160408.161445-5167
and
+-org.apache.hadoop:hadoop-mapreduce-client-app:3.0.0-SNAPSHOT
  +-org.apache.hadoop:hadoop-yarn-server-tests:3.0.0-SNAPSHOT
    +-org.apache.hadoop:hadoop-yarn-server-resourcemanager:3.0.0-SNAPSHOT
, 
Dependency convergence error for org.apache.hadoop:hadoop-yarn-server-nodemanager:3.0.0-20160408.161437-5179
paths to dependency are:
+-org.apache.hadoop:hadoop-mapreduce-client-app:3.0.0-SNAPSHOT
  +-org.apache.hadoop:hadoop-yarn-server-nodemanager:3.0.0-20160408.161437-5179
and
+-org.apache.hadoop:hadoop-mapreduce-client-app:3.0.0-SNAPSHOT
  +-org.apache.hadoop:hadoop-mapreduce-client-shuffle:3.0.0-SNAPSHOT
    +-org.apache.hadoop:hadoop-yarn-server-nodemanager:3.0.0-SNAPSHOT
and
+-org.apache.hadoop:hadoop-mapreduce-client-app:3.0.0-SNAPSHOT
  +-org.apache.hadoop:hadoop-yarn-server-tests:3.0.0-SNAPSHOT
    +-org.apache.hadoop:hadoop-yarn-server-nodemanager:3.0.0-SNAPSHOT
]
[INFO] ------------------------------------------------------------------------
[INFO] Reactor Summary:
[INFO] 
[INFO] Apache Hadoop MapReduce Client .................... SUCCESS [  4.794 s]
[INFO] Apache Hadoop MapReduce Core ...................... SUCCESS [02:04 min]
[INFO] Apache Hadoop MapReduce Common .................... SUCCESS [ 30.450 s]
[INFO] Apache Hadoop MapReduce Shuffle ................... SUCCESS [  6.400 s]
[INFO] Apache Hadoop MapReduce App ....................... FAILURE [09:19 min]
[INFO] Apache Hadoop MapReduce HistoryServer ............. SKIPPED
[INFO] Apache Hadoop MapReduce JobClient ................. SKIPPED
[INFO] Apache Hadoop MapReduce HistoryServer Plugins ..... SKIPPED
[INFO] Apache Hadoop MapReduce NativeTask ................ SKIPPED
[INFO] Apache Hadoop MapReduce Examples .................. SKIPPED
[INFO] Apache Hadoop MapReduce ........................... SKIPPED
[INFO] ------------------------------------------------------------------------
[INFO] BUILD FAILURE
[INFO] ------------------------------------------------------------------------
[INFO] Total time: 12:06 min
[INFO] Finished at: 2016-04-08T16:47:00+00:00
[INFO] Final Memory: 58M/741M
[INFO] ------------------------------------------------------------------------
[ERROR] Failed to execute goal org.apache.maven.plugins:maven-enforcer-plugin:1.3.1:enforce
(depcheck) on project hadoop-mapreduce-client-app: Some Enforcer rules have failed. Look above
for specific messages explaining why the rule failed. -> [Help 1]
[ERROR] 
[ERROR] To see the full stack trace of the errors, re-run Maven with the -e switch.
[ERROR] Re-run Maven using the -X switch to enable full debug logging.
[ERROR] 
[ERROR] For more information about the errors and possible solutions, please read the following
articles:
[ERROR] [Help 1] http://cwiki.apache.org/confluence/display/MAVEN/MojoExecutionException
[ERROR] 
[ERROR] After correcting the problems, you can resume the build with the command
[ERROR]   mvn <goals> -rf :hadoop-mapreduce-client-app
Build step 'Execute shell' marked build as failure
[FINDBUGS] Skipping publisher since build result is FAILURE
Archiving artifacts
Recording test results
Email was triggered for: Failure - Any
Sending email for trigger: Failure - Any



###################################################################################
############################## FAILED TESTS (if any) ##############################
All tests passed
Mime
  • Unnamed multipart/mixed (inline, None, 0 bytes)
View raw message