hadoop-mapreduce-dev mailing list archives

Site index · List index
Message view « Date » · « Thread »
Top « Date » · « Thread »
From Apache Jenkins Server <jenk...@builds.apache.org>
Subject Hadoop-Mapreduce-trunk-Java8 - Build # 1220 - Still Failing
Date Sat, 02 Apr 2016 00:24:14 GMT
See https://builds.apache.org/job/Hadoop-Mapreduce-trunk-Java8/1220/

###################################################################################
########################## LAST 60 LINES OF THE CONSOLE ###########################
[...truncated 9555 lines...]
Tests run: 2, Failures: 0, Errors: 0, Skipped: 0, Time elapsed: 15.496 sec - in org.apache.hadoop.hdfs.TestNNBench
Java HotSpot(TM) 64-Bit Server VM warning: ignoring option MaxPermSize=768m; support was removed
in 8.0
Running org.apache.hadoop.util.TestMRCJCReflectionUtils
Tests run: 1, Failures: 0, Errors: 0, Skipped: 0, Time elapsed: 0.494 sec - in org.apache.hadoop.util.TestMRCJCReflectionUtils
Java HotSpot(TM) 64-Bit Server VM warning: ignoring option MaxPermSize=768m; support was removed
in 8.0
Running org.apache.hadoop.util.TestMRCJCRunJar
Tests run: 1, Failures: 0, Errors: 0, Skipped: 0, Time elapsed: 0.241 sec - in org.apache.hadoop.util.TestMRCJCRunJar
Java HotSpot(TM) 64-Bit Server VM warning: ignoring option MaxPermSize=768m; support was removed
in 8.0
Running org.apache.hadoop.io.TestSequenceFileMergeProgress
Tests run: 3, Failures: 0, Errors: 0, Skipped: 0, Time elapsed: 1.497 sec - in org.apache.hadoop.io.TestSequenceFileMergeProgress

Results :

Failed tests: 
  TestMRJobs.testJobWithChangePriority:276 expected:<DEFAULT> but was:<HIGH>
  TestUberAM>TestMRJobs.testJobWithChangePriority:276 expected:<DEFAULT> but was:<HIGH>

Tests run: 533, Failures: 2, Errors: 0, Skipped: 11

[INFO] ------------------------------------------------------------------------
[INFO] Reactor Summary:
[INFO] 
[INFO] Apache Hadoop MapReduce Client .................... SUCCESS [  2.462 s]
[INFO] Apache Hadoop MapReduce Core ...................... SUCCESS [01:38 min]
[INFO] Apache Hadoop MapReduce Common .................... SUCCESS [ 24.330 s]
[INFO] Apache Hadoop MapReduce Shuffle ................... SUCCESS [  4.426 s]
[INFO] Apache Hadoop MapReduce App ....................... SUCCESS [10:58 min]
[INFO] Apache Hadoop MapReduce HistoryServer ............. SUCCESS [06:08 min]
[INFO] Apache Hadoop MapReduce JobClient ................. FAILURE [  01:44 h]
[INFO] Apache Hadoop MapReduce HistoryServer Plugins ..... SKIPPED
[INFO] Apache Hadoop MapReduce NativeTask ................ SKIPPED
[INFO] Apache Hadoop MapReduce Examples .................. SKIPPED
[INFO] Apache Hadoop MapReduce ........................... SKIPPED
[INFO] ------------------------------------------------------------------------
[INFO] BUILD FAILURE
[INFO] ------------------------------------------------------------------------
[INFO] Total time: 02:04 h
[INFO] Finished at: 2016-04-02T00:24:10+00:00
[INFO] Final Memory: 34M/153M
[INFO] ------------------------------------------------------------------------
[ERROR] Failed to execute goal org.apache.maven.plugins:maven-surefire-plugin:2.17:test (default-test)
on project hadoop-mapreduce-client-jobclient: There are test failures.
[ERROR] 
[ERROR] Please refer to /home/jenkins/jenkins-slave/workspace/Hadoop-Mapreduce-trunk-Java8/hadoop-mapreduce-project/hadoop-mapreduce-client/hadoop-mapreduce-client-jobclient/target/surefire-reports
for the individual test results.
[ERROR] -> [Help 1]
[ERROR] 
[ERROR] To see the full stack trace of the errors, re-run Maven with the -e switch.
[ERROR] Re-run Maven using the -X switch to enable full debug logging.
[ERROR] 
[ERROR] For more information about the errors and possible solutions, please read the following
articles:
[ERROR] [Help 1] http://cwiki.apache.org/confluence/display/MAVEN/MojoFailureException
[ERROR] 
[ERROR] After correcting the problems, you can resume the build with the command
[ERROR]   mvn <goals> -rf :hadoop-mapreduce-client-jobclient
Build step 'Execute shell' marked build as failure
[FINDBUGS] Skipping publisher since build result is FAILURE
Archiving artifacts
Recording test results
Email was triggered for: Failure - Any
Sending email for trigger: Failure - Any



###################################################################################
############################## FAILED TESTS (if any) ##############################
2 tests failed.
FAILED:  org.apache.hadoop.mapreduce.v2.TestMRJobs.testJobWithChangePriority

Error Message:
expected:<DEFAULT> but was:<HIGH>

Stack Trace:
java.lang.AssertionError: expected:<DEFAULT> but was:<HIGH>
	at org.junit.Assert.fail(Assert.java:88)
	at org.junit.Assert.failNotEquals(Assert.java:743)
	at org.junit.Assert.assertEquals(Assert.java:118)
	at org.junit.Assert.assertEquals(Assert.java:144)
	at org.apache.hadoop.mapreduce.v2.TestMRJobs.testJobWithChangePriority(TestMRJobs.java:276)


FAILED:  org.apache.hadoop.mapreduce.v2.TestUberAM.testJobWithChangePriority

Error Message:
expected:<DEFAULT> but was:<HIGH>

Stack Trace:
java.lang.AssertionError: expected:<DEFAULT> but was:<HIGH>
	at org.junit.Assert.fail(Assert.java:88)
	at org.junit.Assert.failNotEquals(Assert.java:743)
	at org.junit.Assert.assertEquals(Assert.java:118)
	at org.junit.Assert.assertEquals(Assert.java:144)
	at org.apache.hadoop.mapreduce.v2.TestMRJobs.testJobWithChangePriority(TestMRJobs.java:276)
	at sun.reflect.NativeMethodAccessorImpl.invoke0(Native Method)
	at sun.reflect.NativeMethodAccessorImpl.invoke(NativeMethodAccessorImpl.java:62)
	at sun.reflect.DelegatingMethodAccessorImpl.invoke(DelegatingMethodAccessorImpl.java:43)
	at java.lang.reflect.Method.invoke(Method.java:483)
	at org.junit.runners.model.FrameworkMethod$1.runReflectiveCall(FrameworkMethod.java:47)
	at org.junit.internal.runners.model.ReflectiveCallable.run(ReflectiveCallable.java:12)
	at org.junit.runners.model.FrameworkMethod.invokeExplosively(FrameworkMethod.java:44)
	at org.junit.internal.runners.statements.InvokeMethod.evaluate(InvokeMethod.java:17)
	at org.junit.internal.runners.statements.FailOnTimeout$StatementThread.run(FailOnTimeout.java:74)



Mime
  • Unnamed multipart/mixed (inline, None, 0 bytes)
View raw message