hadoop-mapreduce-dev mailing list archives

Site index · List index
Message view « Date » · « Thread »
Top « Date » · « Thread »
From Apache Jenkins Server <jenk...@builds.apache.org>
Subject Hadoop-Mapreduce-trunk - Build # 3178 - Still Failing
Date Sat, 09 Apr 2016 10:38:48 GMT
See https://builds.apache.org/job/Hadoop-Mapreduce-trunk/3178/

###################################################################################
########################## LAST 60 LINES OF THE CONSOLE ###########################
[...truncated 8217 lines...]
+-org.apache.hadoop:hadoop-mapreduce-client-common:3.0.0-SNAPSHOT
  +-org.apache.hadoop:hadoop-yarn-server-common:3.0.0-20160409.003029-5493
    +-org.apache.hadoop:hadoop-yarn-common:3.0.0-SNAPSHOT

[WARNING] Rule 0: org.apache.maven.plugins.enforcer.DependencyConvergence failed with message:
Failed while enforcing releasability the error(s) are [
Dependency convergence error for org.apache.hadoop:hadoop-yarn-common:3.0.0-20160409.003004-5499
paths to dependency are:
+-org.apache.hadoop:hadoop-mapreduce-client-common:3.0.0-SNAPSHOT
  +-org.apache.hadoop:hadoop-yarn-common:3.0.0-20160409.003004-5499
and
+-org.apache.hadoop:hadoop-mapreduce-client-common:3.0.0-SNAPSHOT
  +-org.apache.hadoop:hadoop-yarn-client:3.0.0-20160409.003039-3785
    +-org.apache.hadoop:hadoop-yarn-common:3.0.0-SNAPSHOT
and
+-org.apache.hadoop:hadoop-mapreduce-client-common:3.0.0-SNAPSHOT
  +-org.apache.hadoop:hadoop-mapreduce-client-core:3.0.0-SNAPSHOT
    +-org.apache.hadoop:hadoop-yarn-common:3.0.0-SNAPSHOT
and
+-org.apache.hadoop:hadoop-mapreduce-client-common:3.0.0-SNAPSHOT
  +-org.apache.hadoop:hadoop-yarn-server-common:3.0.0-20160409.003029-5493
    +-org.apache.hadoop:hadoop-yarn-common:3.0.0-SNAPSHOT
]
[INFO] ------------------------------------------------------------------------
[INFO] Reactor Summary:
[INFO] 
[INFO] Apache Hadoop MapReduce Client .................... SUCCESS [  9.768 s]
[INFO] Apache Hadoop MapReduce Core ...................... SUCCESS [02:32 min]
[INFO] Apache Hadoop MapReduce Common .................... FAILURE [ 40.846 s]
[INFO] Apache Hadoop MapReduce Shuffle ................... SKIPPED
[INFO] Apache Hadoop MapReduce App ....................... SKIPPED
[INFO] Apache Hadoop MapReduce HistoryServer ............. SKIPPED
[INFO] Apache Hadoop MapReduce JobClient ................. SKIPPED
[INFO] Apache Hadoop MapReduce HistoryServer Plugins ..... SKIPPED
[INFO] Apache Hadoop MapReduce NativeTask ................ SKIPPED
[INFO] Apache Hadoop MapReduce Examples .................. SKIPPED
[INFO] Apache Hadoop MapReduce ........................... SKIPPED
[INFO] ------------------------------------------------------------------------
[INFO] BUILD FAILURE
[INFO] ------------------------------------------------------------------------
[INFO] Total time: 03:25 min
[INFO] Finished at: 2016-04-09T10:38:54+00:00
[INFO] Final Memory: 47M/884M
[INFO] ------------------------------------------------------------------------
[ERROR] Failed to execute goal org.apache.maven.plugins:maven-enforcer-plugin:1.3.1:enforce
(depcheck) on project hadoop-mapreduce-client-common: Some Enforcer rules have failed. Look
above for specific messages explaining why the rule failed. -> [Help 1]
[ERROR] 
[ERROR] To see the full stack trace of the errors, re-run Maven with the -e switch.
[ERROR] Re-run Maven using the -X switch to enable full debug logging.
[ERROR] 
[ERROR] For more information about the errors and possible solutions, please read the following
articles:
[ERROR] [Help 1] http://cwiki.apache.org/confluence/display/MAVEN/MojoExecutionException
[ERROR] 
[ERROR] After correcting the problems, you can resume the build with the command
[ERROR]   mvn <goals> -rf :hadoop-mapreduce-client-common
Build step 'Execute shell' marked build as failure
[FINDBUGS] Skipping publisher since build result is FAILURE
Archiving artifacts
Recording test results
Email was triggered for: Failure - Any
Sending email for trigger: Failure - Any



###################################################################################
############################## FAILED TESTS (if any) ##############################
All tests passed
Mime
  • Unnamed multipart/mixed (inline, None, 0 bytes)
View raw message