hadoop-mapreduce-dev mailing list archives

Site index · List index
Message view « Date » · « Thread »
Top « Date » · « Thread »
From Apache Jenkins Server <jenk...@builds.apache.org>
Subject Hadoop-Mapreduce-trunk-Java8 - Build # 1271 - Still Failing
Date Wed, 13 Apr 2016 20:05:55 GMT
See https://builds.apache.org/job/Hadoop-Mapreduce-trunk-Java8/1271/

###################################################################################
########################## LAST 60 LINES OF THE CONSOLE ###########################
[...truncated 9587 lines...]
Tests run: 1, Failures: 0, Errors: 0, Skipped: 0, Time elapsed: 71.386 sec - in org.apache.hadoop.mapred.TestReduceFetchFromPartialMem
Java HotSpot(TM) 64-Bit Server VM warning: ignoring option MaxPermSize=768m; support was removed
in 8.0
Running org.apache.hadoop.mapred.TestSpecialCharactersInOutputPath
Tests run: 1, Failures: 0, Errors: 0, Skipped: 0, Time elapsed: 23.505 sec - in org.apache.hadoop.mapred.TestSpecialCharactersInOutputPath
Java HotSpot(TM) 64-Bit Server VM warning: ignoring option MaxPermSize=768m; support was removed
in 8.0
Running org.apache.hadoop.mapred.TestSequenceFileAsBinaryOutputFormat
Tests run: 3, Failures: 0, Errors: 0, Skipped: 0, Time elapsed: 1.443 sec - in org.apache.hadoop.mapred.TestSequenceFileAsBinaryOutputFormat

Results :

Failed tests: 
  TestUberAM.testSleepJob:57->TestMRJobs.testSleepJob:193->TestMRJobs.testSleepJobInternal:240->verifySleepJobCounters:71->TestMRJobs.verifySleepJobCounters:475
null
  TestUberAM.testSleepJobWithMultipleReducers:64->TestMRJobs.testSleepJob:193->TestMRJobs.testSleepJobInternal:240->verifySleepJobCounters:71->TestMRJobs.verifySleepJobCounters:475
null
  TestUberAM.testRandomWriter:84->TestMRJobs.testRandomWriter:539->verifyRandomWriterCounters:90->TestMRJobs.verifyRandomWriterCounters:552
null
  TestUberAM>TestMRJobs.testSleepJobWithRemoteJar:198->TestMRJobs.testSleepJobInternal:240->verifySleepJobCounters:71->TestMRJobs.verifySleepJobCounters:475
null
  TestMiniMRWithDFSWithDistinctUsers.setUp:78 Test resulted in an unexpected exit

Tests in error: 
  TestMiniMRWithDFSWithDistinctUsers.tearDown:104 ยป NoClassDefFound org/apache/h...

Tests run: 531, Failures: 5, Errors: 1, Skipped: 11

[INFO] ------------------------------------------------------------------------
[INFO] Reactor Summary:
[INFO] 
[INFO] Apache Hadoop MapReduce Client .................... SUCCESS [  3.033 s]
[INFO] Apache Hadoop MapReduce Core ...................... SUCCESS [01:47 min]
[INFO] Apache Hadoop MapReduce Common .................... SUCCESS [ 24.443 s]
[INFO] Apache Hadoop MapReduce Shuffle ................... SUCCESS [  4.391 s]
[INFO] Apache Hadoop MapReduce App ....................... SUCCESS [10:52 min]
[INFO] Apache Hadoop MapReduce HistoryServer ............. SUCCESS [06:10 min]
[INFO] Apache Hadoop MapReduce JobClient ................. FAILURE [  01:52 h]
[INFO] Apache Hadoop MapReduce HistoryServer Plugins ..... SKIPPED
[INFO] Apache Hadoop MapReduce NativeTask ................ SKIPPED
[INFO] Apache Hadoop MapReduce Examples .................. SKIPPED
[INFO] Apache Hadoop MapReduce ........................... SKIPPED
[INFO] ------------------------------------------------------------------------
[INFO] BUILD FAILURE
[INFO] ------------------------------------------------------------------------
[INFO] Total time: 02:12 h
[INFO] Finished at: 2016-04-13T20:05:46+00:00
[INFO] Final Memory: 37M/154M
[INFO] ------------------------------------------------------------------------
[ERROR] Failed to execute goal org.apache.maven.plugins:maven-surefire-plugin:2.17:test (default-test)
on project hadoop-mapreduce-client-jobclient: There was a timeout or other error in the fork
-> [Help 1]
[ERROR] 
[ERROR] To see the full stack trace of the errors, re-run Maven with the -e switch.
[ERROR] Re-run Maven using the -X switch to enable full debug logging.
[ERROR] 
[ERROR] For more information about the errors and possible solutions, please read the following
articles:
[ERROR] [Help 1] http://cwiki.apache.org/confluence/display/MAVEN/MojoFailureException
[ERROR] 
[ERROR] After correcting the problems, you can resume the build with the command
[ERROR]   mvn <goals> -rf :hadoop-mapreduce-client-jobclient
Build step 'Execute shell' marked build as failure
[FINDBUGS] Skipping publisher since build result is FAILURE
Archiving artifacts
Recording test results
Email was triggered for: Failure - Any
Sending email for trigger: Failure - Any



###################################################################################
############################## FAILED TESTS (if any) ##############################
6 tests failed.
FAILED:  org.apache.hadoop.mapred.TestMiniMRWithDFSWithDistinctUsers.testMultipleSpills

Error Message:
org/apache/hadoop/hdfs/server/namenode/JournalSet$5

Stack Trace:
java.lang.NoClassDefFoundError: org/apache/hadoop/hdfs/server/namenode/JournalSet$5
	at org.apache.hadoop.hdfs.server.namenode.JournalSet.close(JournalSet.java:243)
	at org.apache.hadoop.hdfs.server.namenode.FSEditLog.close(FSEditLog.java:375)
	at org.apache.hadoop.hdfs.server.namenode.FSNamesystem.stopActiveServices(FSNamesystem.java:1202)
	at org.apache.hadoop.hdfs.server.namenode.FSNamesystem.close(FSNamesystem.java:1558)
	at org.apache.hadoop.hdfs.server.namenode.NameNode.stopCommonServices(NameNode.java:790)
	at org.apache.hadoop.hdfs.server.namenode.NameNode.stop(NameNode.java:969)
	at org.apache.hadoop.hdfs.MiniDFSCluster.stopAndJoinNameNode(MiniDFSCluster.java:1965)
	at org.apache.hadoop.hdfs.MiniDFSCluster.shutdown(MiniDFSCluster.java:1911)
	at org.apache.hadoop.hdfs.MiniDFSCluster.shutdown(MiniDFSCluster.java:1882)
	at org.apache.hadoop.hdfs.MiniDFSCluster.shutdown(MiniDFSCluster.java:1875)
	at org.apache.hadoop.mapred.TestMiniMRWithDFSWithDistinctUsers.tearDown(TestMiniMRWithDFSWithDistinctUsers.java:104)


FAILED:  org.apache.hadoop.mapred.TestMiniMRWithDFSWithDistinctUsers.testDistinctUsers

Error Message:
Test resulted in an unexpected exit

Stack Trace:
java.lang.AssertionError: Test resulted in an unexpected exit
	at org.apache.hadoop.hdfs.MiniDFSCluster.shutdown(MiniDFSCluster.java:1895)
	at org.apache.hadoop.hdfs.MiniDFSCluster.shutdown(MiniDFSCluster.java:1882)
	at org.apache.hadoop.hdfs.MiniDFSCluster.shutdown(MiniDFSCluster.java:1875)
	at org.apache.hadoop.hdfs.MiniDFSCluster.initMiniDFSCluster(MiniDFSCluster.java:854)
	at org.apache.hadoop.hdfs.MiniDFSCluster.<init>(MiniDFSCluster.java:482)
	at org.apache.hadoop.hdfs.MiniDFSCluster$Builder.build(MiniDFSCluster.java:441)
	at org.apache.hadoop.mapred.TestMiniMRWithDFSWithDistinctUsers.setUp(TestMiniMRWithDFSWithDistinctUsers.java:78)


FAILED:  org.apache.hadoop.mapreduce.v2.TestUberAM.testSleepJob

Error Message:
null

Stack Trace:
java.lang.AssertionError: null
	at org.junit.Assert.fail(Assert.java:86)
	at org.junit.Assert.assertTrue(Assert.java:41)
	at org.junit.Assert.assertTrue(Assert.java:52)
	at org.apache.hadoop.mapreduce.v2.TestMRJobs.verifySleepJobCounters(TestMRJobs.java:475)
	at org.apache.hadoop.mapreduce.v2.TestUberAM.verifySleepJobCounters(TestUberAM.java:71)


FAILED:  org.apache.hadoop.mapreduce.v2.TestUberAM.testSleepJobWithMultipleReducers

Error Message:
null

Stack Trace:
java.lang.AssertionError: null
	at org.junit.Assert.fail(Assert.java:86)
	at org.junit.Assert.assertTrue(Assert.java:41)
	at org.junit.Assert.assertTrue(Assert.java:52)
	at org.apache.hadoop.mapreduce.v2.TestMRJobs.verifySleepJobCounters(TestMRJobs.java:475)
	at org.apache.hadoop.mapreduce.v2.TestUberAM.verifySleepJobCounters(TestUberAM.java:71)


FAILED:  org.apache.hadoop.mapreduce.v2.TestUberAM.testRandomWriter

Error Message:
null

Stack Trace:
java.lang.AssertionError: null
	at org.junit.Assert.fail(Assert.java:86)
	at org.junit.Assert.assertTrue(Assert.java:41)
	at org.junit.Assert.assertTrue(Assert.java:52)
	at org.apache.hadoop.mapreduce.v2.TestMRJobs.verifyRandomWriterCounters(TestMRJobs.java:552)
	at org.apache.hadoop.mapreduce.v2.TestUberAM.verifyRandomWriterCounters(TestUberAM.java:90)


FAILED:  org.apache.hadoop.mapreduce.v2.TestUberAM.testSleepJobWithRemoteJar

Error Message:
null

Stack Trace:
java.lang.AssertionError: null
	at org.junit.Assert.fail(Assert.java:86)
	at org.junit.Assert.assertTrue(Assert.java:41)
	at org.junit.Assert.assertTrue(Assert.java:52)
	at org.apache.hadoop.mapreduce.v2.TestMRJobs.verifySleepJobCounters(TestMRJobs.java:475)
	at org.apache.hadoop.mapreduce.v2.TestUberAM.verifySleepJobCounters(TestUberAM.java:71)



Mime
  • Unnamed multipart/mixed (inline, None, 0 bytes)
View raw message