hadoop-mapreduce-dev mailing list archives

Site index · List index
Message view « Date » · « Thread »
Top « Date » · « Thread »
From Apache Jenkins Server <jenk...@builds.apache.org>
Subject Hadoop-Mapreduce-trunk-Java8 - Build # 1290 - Still Failing
Date Mon, 18 Apr 2016 21:45:35 GMT
See https://builds.apache.org/job/Hadoop-Mapreduce-trunk-Java8/1290/

###################################################################################
########################## LAST 60 LINES OF THE CONSOLE ###########################
[...truncated 9564 lines...]
Running org.apache.hadoop.mapred.TestReduceFetchFromPartialMem
Tests run: 1, Failures: 0, Errors: 0, Skipped: 0, Time elapsed: 71.699 sec - in org.apache.hadoop.mapred.TestReduceFetchFromPartialMem
Java HotSpot(TM) 64-Bit Server VM warning: ignoring option MaxPermSize=768m; support was removed
in 8.0
Running org.apache.hadoop.mapred.TestSpecialCharactersInOutputPath
Tests run: 1, Failures: 0, Errors: 0, Skipped: 0, Time elapsed: 24.017 sec - in org.apache.hadoop.mapred.TestSpecialCharactersInOutputPath
Java HotSpot(TM) 64-Bit Server VM warning: ignoring option MaxPermSize=768m; support was removed
in 8.0
Running org.apache.hadoop.mapred.TestSequenceFileAsBinaryOutputFormat
Tests run: 3, Failures: 0, Errors: 0, Skipped: 0, Time elapsed: 1.515 sec - in org.apache.hadoop.mapred.TestSequenceFileAsBinaryOutputFormat

Results :

Failed tests: 
  TestUberAM.testSleepJob:57->TestMRJobs.testSleepJob:193->TestMRJobs.testSleepJobInternal:240->verifySleepJobCounters:71->TestMRJobs.verifySleepJobCounters:475
null
  TestUberAM.testSleepJobWithMultipleReducers:64->TestMRJobs.testSleepJob:193->TestMRJobs.testSleepJobInternal:240->verifySleepJobCounters:71->TestMRJobs.verifySleepJobCounters:475
null
  TestUberAM.testRandomWriter:84->TestMRJobs.testRandomWriter:539->verifyRandomWriterCounters:90->TestMRJobs.verifyRandomWriterCounters:552
null
  TestUberAM>TestMRJobs.testSleepJobWithRemoteJar:198->TestMRJobs.testSleepJobInternal:240->verifySleepJobCounters:71->TestMRJobs.verifySleepJobCounters:475
null

Tests run: 533, Failures: 4, Errors: 0, Skipped: 11

[INFO] ------------------------------------------------------------------------
[INFO] Reactor Summary:
[INFO] 
[INFO] Apache Hadoop MapReduce Client .................... SUCCESS [  2.257 s]
[INFO] Apache Hadoop MapReduce Core ...................... SUCCESS [01:40 min]
[INFO] Apache Hadoop MapReduce Common .................... SUCCESS [ 24.389 s]
[INFO] Apache Hadoop MapReduce Shuffle ................... SUCCESS [  4.474 s]
[INFO] Apache Hadoop MapReduce App ....................... SUCCESS [11:02 min]
[INFO] Apache Hadoop MapReduce HistoryServer ............. SUCCESS [06:09 min]
[INFO] Apache Hadoop MapReduce JobClient ................. FAILURE [  01:49 h]
[INFO] Apache Hadoop MapReduce HistoryServer Plugins ..... SKIPPED
[INFO] Apache Hadoop MapReduce NativeTask ................ SKIPPED
[INFO] Apache Hadoop MapReduce Examples .................. SKIPPED
[INFO] Apache Hadoop MapReduce ........................... SKIPPED
[INFO] ------------------------------------------------------------------------
[INFO] BUILD FAILURE
[INFO] ------------------------------------------------------------------------
[INFO] Total time: 02:08 h
[INFO] Finished at: 2016-04-18T21:45:25+00:00
[INFO] Final Memory: 34M/148M
[INFO] ------------------------------------------------------------------------
[ERROR] Failed to execute goal org.apache.maven.plugins:maven-surefire-plugin:2.17:test (default-test)
on project hadoop-mapreduce-client-jobclient: There are test failures.
[ERROR] 
[ERROR] Please refer to /home/jenkins/jenkins-slave/workspace/Hadoop-Mapreduce-trunk-Java8/hadoop-mapreduce-project/hadoop-mapreduce-client/hadoop-mapreduce-client-jobclient/target/surefire-reports
for the individual test results.
[ERROR] -> [Help 1]
[ERROR] 
[ERROR] To see the full stack trace of the errors, re-run Maven with the -e switch.
[ERROR] Re-run Maven using the -X switch to enable full debug logging.
[ERROR] 
[ERROR] For more information about the errors and possible solutions, please read the following
articles:
[ERROR] [Help 1] http://cwiki.apache.org/confluence/display/MAVEN/MojoFailureException
[ERROR] 
[ERROR] After correcting the problems, you can resume the build with the command
[ERROR]   mvn <goals> -rf :hadoop-mapreduce-client-jobclient
Build step 'Execute shell' marked build as failure
[FINDBUGS] Skipping publisher since build result is FAILURE
Archiving artifacts
Recording test results
Email was triggered for: Failure - Any
Sending email for trigger: Failure - Any



###################################################################################
############################## FAILED TESTS (if any) ##############################
4 tests failed.
FAILED:  org.apache.hadoop.mapreduce.v2.TestUberAM.testSleepJob

Error Message:
null

Stack Trace:
java.lang.AssertionError: null
	at org.junit.Assert.fail(Assert.java:86)
	at org.junit.Assert.assertTrue(Assert.java:41)
	at org.junit.Assert.assertTrue(Assert.java:52)
	at org.apache.hadoop.mapreduce.v2.TestMRJobs.verifySleepJobCounters(TestMRJobs.java:475)
	at org.apache.hadoop.mapreduce.v2.TestUberAM.verifySleepJobCounters(TestUberAM.java:71)


FAILED:  org.apache.hadoop.mapreduce.v2.TestUberAM.testSleepJobWithMultipleReducers

Error Message:
null

Stack Trace:
java.lang.AssertionError: null
	at org.junit.Assert.fail(Assert.java:86)
	at org.junit.Assert.assertTrue(Assert.java:41)
	at org.junit.Assert.assertTrue(Assert.java:52)
	at org.apache.hadoop.mapreduce.v2.TestMRJobs.verifySleepJobCounters(TestMRJobs.java:475)
	at org.apache.hadoop.mapreduce.v2.TestUberAM.verifySleepJobCounters(TestUberAM.java:71)


FAILED:  org.apache.hadoop.mapreduce.v2.TestUberAM.testRandomWriter

Error Message:
null

Stack Trace:
java.lang.AssertionError: null
	at org.junit.Assert.fail(Assert.java:86)
	at org.junit.Assert.assertTrue(Assert.java:41)
	at org.junit.Assert.assertTrue(Assert.java:52)
	at org.apache.hadoop.mapreduce.v2.TestMRJobs.verifyRandomWriterCounters(TestMRJobs.java:552)
	at org.apache.hadoop.mapreduce.v2.TestUberAM.verifyRandomWriterCounters(TestUberAM.java:90)


FAILED:  org.apache.hadoop.mapreduce.v2.TestUberAM.testSleepJobWithRemoteJar

Error Message:
null

Stack Trace:
java.lang.AssertionError: null
	at org.junit.Assert.fail(Assert.java:86)
	at org.junit.Assert.assertTrue(Assert.java:41)
	at org.junit.Assert.assertTrue(Assert.java:52)
	at org.apache.hadoop.mapreduce.v2.TestMRJobs.verifySleepJobCounters(TestMRJobs.java:475)
	at org.apache.hadoop.mapreduce.v2.TestUberAM.verifySleepJobCounters(TestUberAM.java:71)



Mime
  • Unnamed multipart/mixed (inline, None, 0 bytes)
View raw message