hadoop-yarn-dev mailing list archives

Site index · List index
Message view « Date » · « Thread »
Top « Date » · « Thread »
From Apache Jenkins Server <jenk...@builds.apache.org>
Subject Hadoop-Yarn-trunk - Build # 230 - Failure
Date Tue, 04 Jun 2013 10:50:27 GMT
See https://builds.apache.org/job/Hadoop-Yarn-trunk/230/

###################################################################################
########################## LAST 60 LINES OF THE CONSOLE ###########################
[...truncated 13455 lines...]
[INFO] hadoop-yarn-server-common ......................... SUCCESS [21.990s]
[INFO] hadoop-yarn-server-nodemanager .................... SUCCESS [4:07.096s]
[INFO] hadoop-yarn-server-web-proxy ...................... SUCCESS [13.401s]
[INFO] hadoop-yarn-server-resourcemanager ................ SUCCESS [5:18.168s]
[INFO] hadoop-yarn-server-tests .......................... SUCCESS [1:08.580s]
[INFO] hadoop-yarn-client ................................ FAILURE [47.650s]
[INFO] hadoop-yarn-applications .......................... SKIPPED
[INFO] hadoop-yarn-applications-distributedshell ......... SKIPPED
[INFO] hadoop-yarn-applications-unmanaged-am-launcher .... SKIPPED
[INFO] hadoop-yarn-site .................................. SKIPPED
[INFO] hadoop-yarn-project ............................... SKIPPED
[INFO] ------------------------------------------------------------------------
[INFO] BUILD FAILURE
[INFO] ------------------------------------------------------------------------
[INFO] Total time: 15:42.154s
[INFO] Finished at: Tue Jun 04 10:50:19 UTC 2013
[INFO] Final Memory: 50M/757M
[INFO] ------------------------------------------------------------------------
[ERROR] Failed to execute goal org.apache.maven.plugins:maven-surefire-plugin:2.12.3:test
(default-test) on project hadoop-yarn-client: There are test failures.
[ERROR] 
[ERROR] Please refer to /home/jenkins/jenkins-slave/workspace/Hadoop-Yarn-trunk/trunk/hadoop-yarn-project/hadoop-yarn/hadoop-yarn-client/target/surefire-reports
for the individual test results.
[ERROR] -> [Help 1]
[ERROR] 
[ERROR] To see the full stack trace of the errors, re-run Maven with the -e switch.
[ERROR] Re-run Maven using the -X switch to enable full debug logging.
[ERROR] 
[ERROR] For more information about the errors and possible solutions, please read the following
articles:
[ERROR] [Help 1] http://cwiki.apache.org/confluence/display/MAVEN/MojoFailureException
[ERROR] 
[ERROR] After correcting the problems, you can resume the build with the command
[ERROR]   mvn <goals> -rf :hadoop-yarn-client
Build step 'Execute shell' marked build as failure
Archiving artifacts
Updating YARN-326
Updating MAPREDUCE-5036
Updating HADOOP-9397
Updating MAPREDUCE-5301
Updating HADOOP-9481
Updating MAPREDUCE-5300
Updating MAPREDUCE-5220
Updating YARN-755
Updating YARN-748
Updating YARN-756
Updating YARN-726
Updating HADOOP-9287
Updating YARN-635
Updating HADOOP-9614
Updating YARN-757
Updating MAPREDUCE-5299
Updating HDFS-3934
Updating MAPREDUCE-5297
Updating MAPREDUCE-5245
Updating MAPREDUCE-5296
Updating MAPREDUCE-5283
Updating YARN-398
Updating MAPREDUCE-5268
Sending e-mails to: yarn-dev@hadoop.apache.org
Email was triggered for: Failure
Sending email for trigger: Failure



###################################################################################
############################## FAILED TESTS (if any) ##############################
No tests ran.
Mime
  • Unnamed multipart/mixed (inline, None, 0 bytes)
View raw message