hadoop-yarn-dev mailing list archives

Site index · List index
Message view « Date » · « Thread »
Top « Date » · « Thread »
From Apache Jenkins Server <jenk...@builds.apache.org>
Subject Failed: YARN-1167 PreCommit Build #2058
Date Tue, 01 Oct 2013 21:00:53 GMT
Jira: https://issues.apache.org/jira/browse/YARN-1167
Build: https://builds.apache.org/job/PreCommit-YARN-Build/2058/

###################################################################################
########################## LAST 60 LINES OF THE CONSOLE ###########################
[...truncated 4476 lines...]


{color:red}-1 overall{color}.  Here are the results of testing the latest attachment 
  http://issues.apache.org/jira/secure/attachment/12606176/YARN-1167.1.patch
  against trunk revision .

    {color:green}+1 @author{color}.  The patch does not contain any @author tags.

    {color:red}-1 tests included{color}.  The patch doesn't appear to include any new or modified
tests.
                        Please justify why no new tests are needed for this patch.
                        Also please list what manual steps were performed to verify this patch.

    {color:green}+1 javac{color}.  The applied patch does not increase the total number of
javac compiler warnings.

    {color:green}+1 javadoc{color}.  The javadoc tool did not generate any warning messages.

    {color:green}+1 eclipse:eclipse{color}.  The patch built with eclipse:eclipse.

    {color:green}+1 findbugs{color}.  The patch does not introduce any new Findbugs (version
1.3.9) warnings.

    {color:green}+1 release audit{color}.  The applied patch does not increase the total number
of release audit warnings.

    {color:red}-1 core tests{color}.  The patch failed these unit tests in hadoop-yarn-project/hadoop-yarn/hadoop-yarn-applications/hadoop-yarn-applications-distributedshell:

                  org.apache.hadoop.yarn.applications.distributedshell.TestDistributedShell

    {color:green}+1 contrib tests{color}.  The patch passed contrib unit tests.

Test results: https://builds.apache.org/job/PreCommit-YARN-Build/2058//testReport/
Console output: https://builds.apache.org/job/PreCommit-YARN-Build/2058//console

This message is automatically generated.


======================================================================
======================================================================
    Adding comment to Jira.
======================================================================
======================================================================


Comment added.
e0ee5485848e4769c6589158c9793c8bc2a3a1ac logged out


======================================================================
======================================================================
    Finished build.
======================================================================
======================================================================


Build step 'Execute shell' marked build as failure
Archiving artifacts
[description-setter] Could not determine description.
Recording test results
Publish JUnit test result report is waiting for a checkpoint on PreCommit-YARN-Build #2057
Email was triggered for: Failure
Sending email for trigger: Failure



###################################################################################
############################## FAILED TESTS (if any) ##############################
1 tests failed.
FAILED:  org.apache.hadoop.yarn.applications.distributedshell.TestDistributedShell.testDSShell

Error Message:
test timed out after 90000 milliseconds

Stack Trace:
java.lang.Exception: test timed out after 90000 milliseconds
	at sun.misc.Unsafe.park(Native Method)
	at java.util.concurrent.locks.LockSupport.park(LockSupport.java:158)
	at java.util.concurrent.locks.AbstractQueuedSynchronizer.parkAndCheckInterrupt(AbstractQueuedSynchronizer.java:811)
	at java.util.concurrent.locks.AbstractQueuedSynchronizer.doAcquireSharedInterruptibly(AbstractQueuedSynchronizer.java:969)
	at java.util.concurrent.locks.AbstractQueuedSynchronizer.acquireSharedInterruptibly(AbstractQueuedSynchronizer.java:1281)
	at java.util.concurrent.FutureTask$Sync.innerGet(FutureTask.java:218)
	at java.util.concurrent.FutureTask.get(FutureTask.java:83)
	at org.apache.hadoop.ipc.Client$Connection.sendRpcRequest(Client.java:1024)
	at org.apache.hadoop.ipc.Client.call(Client.java:1377)
	at org.apache.hadoop.ipc.Client.call(Client.java:1357)
	at org.apache.hadoop.ipc.ProtobufRpcEngine$Invoker.invoke(ProtobufRpcEngine.java:206)
	at $Proxy70.getApplicationReport(Unknown Source)
	at org.apache.hadoop.yarn.api.impl.pb.client.ApplicationClientProtocolPBClientImpl.getApplicationReport(ApplicationClientProtocolPBClientImpl.java:137)
	at sun.reflect.GeneratedMethodAccessor40.invoke(Unknown Source)
	at sun.reflect.DelegatingMethodAccessorImpl.invoke(DelegatingMethodAccessorImpl.java:25)
	at java.lang.reflect.Method.invoke(Method.java:597)
	at org.apache.hadoop.io.retry.RetryInvocationHandler.invokeMethod(RetryInvocationHandler.java:185)
	at org.apache.hadoop.io.retry.RetryInvocationHandler.invoke(RetryInvocationHandler.java:101)
	at $Proxy71.getApplicationReport(Unknown Source)
	at org.apache.hadoop.yarn.client.api.impl.YarnClientImpl.getApplicationReport(YarnClientImpl.java:195)
	at org.apache.hadoop.yarn.applications.distributedshell.Client.monitorApplication(Client.java:622)
	at org.apache.hadoop.yarn.applications.distributedshell.Client.run(Client.java:597)
	at org.apache.hadoop.yarn.applications.distributedshell.TestDistributedShell.testDSShell(TestDistributedShell.java:124)



Mime
  • Unnamed multipart/mixed (inline, None, 0 bytes)
View raw message