hadoop-yarn-dev mailing list archives

Site index · List index
Message view « Date » · « Thread »
Top « Date » · « Thread »
From Apache Jenkins Server <jenk...@builds.apache.org>
Subject Hadoop-Yarn-trunk - Build # 437 - Still Failing
Date Mon, 30 Dec 2013 11:06:13 GMT
See https://builds.apache.org/job/Hadoop-Yarn-trunk/437/

###################################################################################
########################## LAST 60 LINES OF THE CONSOLE ###########################
[...truncated 15034 lines...]

Running org.apache.hadoop.yarn.client.TestYarnApiClasses
Tests run: 3, Failures: 0, Errors: 0, Skipped: 0, Time elapsed: 0.313 sec - in org.apache.hadoop.yarn.client.TestYarnApiClasses
Running org.apache.hadoop.yarn.client.TestGetGroups
Tests run: 6, Failures: 0, Errors: 0, Skipped: 0, Time elapsed: 2.635 sec - in org.apache.hadoop.yarn.client.TestGetGroups
Running org.apache.hadoop.yarn.client.TestRMAdminCLI
Tests run: 13, Failures: 0, Errors: 0, Skipped: 0, Time elapsed: 0.616 sec - in org.apache.hadoop.yarn.client.TestRMAdminCLI

Results :

Failed tests: 
  TestRMFailover.testExplicitFailover:129 NMs failed to connect to the RM

Tests run: 77, Failures: 1, Errors: 0, Skipped: 0

[INFO] ------------------------------------------------------------------------
[INFO] Reactor Summary:
[INFO] 
[INFO] hadoop-yarn ....................................... SUCCESS [5.553s]
[INFO] hadoop-yarn-api ................................... SUCCESS [2:29.497s]
[INFO] hadoop-yarn-common ................................ SUCCESS [2:16.779s]
[INFO] hadoop-yarn-server ................................ SUCCESS [0.226s]
[INFO] hadoop-yarn-server-common ......................... SUCCESS [31.794s]
[INFO] hadoop-yarn-server-nodemanager .................... SUCCESS [4:32.609s]
[INFO] hadoop-yarn-server-web-proxy ...................... SUCCESS [19.507s]
[INFO] hadoop-yarn-server-resourcemanager ................ SUCCESS [15:12.268s]
[INFO] hadoop-yarn-server-tests .......................... SUCCESS [1:21.468s]
[INFO] hadoop-yarn-client ................................ FAILURE [4:16.811s]
[INFO] hadoop-yarn-applications .......................... SKIPPED
[INFO] hadoop-yarn-applications-distributedshell ......... SKIPPED
[INFO] hadoop-yarn-applications-unmanaged-am-launcher .... SKIPPED
[INFO] hadoop-yarn-site .................................. SKIPPED
[INFO] hadoop-yarn-project ............................... SKIPPED
[INFO] ------------------------------------------------------------------------
[INFO] BUILD FAILURE
[INFO] ------------------------------------------------------------------------
[INFO] Total time: 31:08.627s
[INFO] Finished at: Mon Dec 30 11:06:06 UTC 2013
[INFO] Final Memory: 57M/783M
[INFO] ------------------------------------------------------------------------
[ERROR] Failed to execute goal org.apache.maven.plugins:maven-surefire-plugin:2.16:test (default-test)
on project hadoop-yarn-client: There are test failures.
[ERROR] 
[ERROR] Please refer to /home/jenkins/jenkins-slave/workspace/Hadoop-Yarn-trunk/trunk/hadoop-yarn-project/hadoop-yarn/hadoop-yarn-client/target/surefire-reports
for the individual test results.
[ERROR] -> [Help 1]
[ERROR] 
[ERROR] To see the full stack trace of the errors, re-run Maven with the -e switch.
[ERROR] Re-run Maven using the -X switch to enable full debug logging.
[ERROR] 
[ERROR] For more information about the errors and possible solutions, please read the following
articles:
[ERROR] [Help 1] http://cwiki.apache.org/confluence/display/MAVEN/MojoFailureException
[ERROR] 
[ERROR] After correcting the problems, you can resume the build with the command
[ERROR]   mvn <goals> -rf :hadoop-yarn-client
Build step 'Execute shell' marked build as failure
Archiving artifacts
Updating HDFS-5675
Sending e-mails to: yarn-dev@hadoop.apache.org
Email was triggered for: Failure
Sending email for trigger: Failure



###################################################################################
############################## FAILED TESTS (if any) ##############################
No tests ran.
Mime
  • Unnamed multipart/mixed (inline, None, 0 bytes)
View raw message