hadoop-yarn-dev mailing list archives

Site index · List index
Message view « Date » · « Thread »
Top « Date » · « Thread »
From Apache Jenkins Server <jenk...@builds.apache.org>
Subject Failed: YARN-1542 PreCommit Build #2733
Date Fri, 27 Dec 2013 01:57:54 GMT
Jira: https://issues.apache.org/jira/browse/YARN-1542
Build: https://builds.apache.org/job/PreCommit-YARN-Build/2733/

###################################################################################
########################## LAST 60 LINES OF THE CONSOLE ###########################
[...truncated 2991 lines...]
NOP




{color:red}-1 overall{color}.  Here are the results of testing the latest attachment 
  http://issues.apache.org/jira/secure/attachment/12620577/YARN-1542.v01.patch
  against trunk revision .

    {color:green}+1 @author{color}.  The patch does not contain any @author tags.

    {color:green}+1 tests included{color}.  The patch appears to include 1 new or modified
test files.

    {color:green}+1 javac{color}.  The applied patch does not increase the total number of
javac compiler warnings.

    {color:green}+1 javadoc{color}.  The javadoc tool did not generate any warning messages.

    {color:green}+1 eclipse:eclipse{color}.  The patch built with eclipse:eclipse.

    {color:green}+1 findbugs{color}.  The patch does not introduce any new Findbugs (version
1.3.9) warnings.

    {color:green}+1 release audit{color}.  The applied patch does not increase the total number
of release audit warnings.

    {color:red}-1 core tests{color}.  The patch failed these unit tests in hadoop-yarn-project/hadoop-yarn/hadoop-yarn-common:

                  org.apache.hadoop.yarn.util.TestFSDownload

    {color:green}+1 contrib tests{color}.  The patch passed contrib unit tests.

Test results: https://builds.apache.org/job/PreCommit-YARN-Build/2733//testReport/
Console output: https://builds.apache.org/job/PreCommit-YARN-Build/2733//console

This message is automatically generated.


======================================================================
======================================================================
    Adding comment to Jira.
======================================================================
======================================================================


Comment added.
381b9c20522aaa62e7324d5c69f77aa0ddcd1ece logged out


======================================================================
======================================================================
    Finished build.
======================================================================
======================================================================


Build step 'Execute shell' marked build as failure
Archiving artifacts
[description-setter] Could not determine description.
Recording test results
Email was triggered for: Failure
Sending email for trigger: Failure



###################################################################################
############################## FAILED TESTS (if any) ##############################
1 tests failed.
FAILED:  org.apache.hadoop.yarn.util.TestFSDownload.testViewFsResource

Error Message:
Resource viewfs:/pubcache/cache.txt is not publicly accessable and as such cannot be part
of the public cache.

Stack Trace:
java.io.IOException: Resource viewfs:/pubcache/cache.txt is not publicly accessable and as
such cannot be part of the public cache.
	at org.apache.hadoop.yarn.util.FSDownload.copy(FSDownload.java:182)
	at org.apache.hadoop.yarn.util.FSDownload.access$000(FSDownload.java:51)
	at org.apache.hadoop.yarn.util.FSDownload$1.run(FSDownload.java:279)
	at org.apache.hadoop.yarn.util.FSDownload$1.run(FSDownload.java:277)
	at java.security.AccessController.doPrivileged(Native Method)
	at javax.security.auth.Subject.doAs(Subject.java:396)
	at org.apache.hadoop.security.UserGroupInformation.doAs(UserGroupInformation.java:1530)
	at org.apache.hadoop.yarn.util.FSDownload.call(FSDownload.java:276)
	at org.apache.hadoop.yarn.util.TestFSDownload.testViewFsResource(TestFSDownload.java:625)



Mime
  • Unnamed multipart/mixed (inline, None, 0 bytes)
View raw message