hadoop-yarn-dev mailing list archives

Site index · List index
Message view « Date » · « Thread »
Top « Date » · « Thread »
From Apache Jenkins Server <jenk...@builds.apache.org>
Subject Failed: YARN-888 PreCommit Build #2816
Date Wed, 08 Jan 2014 00:27:42 GMT
Jira: https://issues.apache.org/jira/browse/YARN-888
Build: https://builds.apache.org/job/PreCommit-YARN-Build/2816/

###################################################################################
########################## LAST 60 LINES OF THE CONSOLE ###########################
[...truncated 9480 lines...]
  http://issues.apache.org/jira/secure/attachment/12621881/YARN-888.patch
  against trunk revision .

    {color:green}+1 @author{color}.  The patch does not contain any @author tags.

    {color:red}-1 tests included{color}.  The patch doesn't appear to include any new or modified
tests.
                        Please justify why no new tests are needed for this patch.
                        Also please list what manual steps were performed to verify this patch.

    {color:green}+1 javac{color}.  The applied patch does not increase the total number of
javac compiler warnings.

    {color:green}+1 javadoc{color}.  The javadoc tool did not generate any warning messages.

    {color:green}+1 eclipse:eclipse{color}.  The patch built with eclipse:eclipse.

    {color:green}+1 findbugs{color}.  The patch does not introduce any new Findbugs (version
1.3.9) warnings.

    {color:green}+1 release audit{color}.  The applied patch does not increase the total number
of release audit warnings.

    {color:red}-1 core tests{color}.  The patch failed these unit tests in hadoop-yarn-project/hadoop-yarn/hadoop-yarn-api
hadoop-yarn-project/hadoop-yarn/hadoop-yarn-applications/hadoop-yarn-applications-distributedshell
hadoop-yarn-project/hadoop-yarn/hadoop-yarn-applications/hadoop-yarn-applications-unmanaged-am-launcher
hadoop-yarn-project/hadoop-yarn/hadoop-yarn-client hadoop-yarn-project/hadoop-yarn/hadoop-yarn-common
hadoop-yarn-project/hadoop-yarn/hadoop-yarn-server/hadoop-yarn-server-common hadoop-yarn-project/hadoop-yarn/hadoop-yarn-server/hadoop-yarn-server-nodemanager
hadoop-yarn-project/hadoop-yarn/hadoop-yarn-server/hadoop-yarn-server-resourcemanager hadoop-yarn-project/hadoop-yarn/hadoop-yarn-server/hadoop-yarn-server-tests
hadoop-yarn-project/hadoop-yarn/hadoop-yarn-server/hadoop-yarn-server-web-proxy:

                  org.apache.hadoop.yarn.server.nodemanager.webapp.TestNMWebServicesApps
                  org.apache.hadoop.yarn.server.nodemanager.webapp.TestNMWebServicesContainers
                  org.apache.hadoop.yarn.server.nodemanager.webapp.TestNMWebServices

                                      The test build failed in hadoop-yarn-project/hadoop-yarn/hadoop-yarn-server/hadoop-yarn-server-web-proxy
hadoop-yarn-project/hadoop-yarn/hadoop-yarn-server/hadoop-yarn-server-tests hadoop-yarn-project/hadoop-yarn/hadoop-yarn-server/hadoop-yarn-server-resourcemanager
hadoop-yarn-project/hadoop-yarn/hadoop-yarn-server/hadoop-yarn-server-common hadoop-yarn-project/hadoop-yarn/hadoop-yarn-common
hadoop-yarn-project/hadoop-yarn/hadoop-yarn-client hadoop-yarn-project/hadoop-yarn/hadoop-yarn-applications/hadoop-yarn-applications-unmanaged-am-launcher
hadoop-yarn-project/hadoop-yarn/hadoop-yarn-applications/hadoop-yarn-applications-distributedshell
hadoop-yarn-project/hadoop-yarn/hadoop-yarn-api 

    {color:green}+1 contrib tests{color}.  The patch passed contrib unit tests.

Test results: https://builds.apache.org/job/PreCommit-YARN-Build/2816//testReport/
Console output: https://builds.apache.org/job/PreCommit-YARN-Build/2816//console

This message is automatically generated.


======================================================================
======================================================================
    Adding comment to Jira.
======================================================================
======================================================================


Comment added.
96e34f2f1d4032a6b150efe098d0fd1a38cd4e45 logged out


======================================================================
======================================================================
    Finished build.
======================================================================
======================================================================


Build step 'Execute shell' marked build as failure
Archiving artifacts
[description-setter] Could not determine description.
Recording test results
Email was triggered for: Failure
Sending email for trigger: Failure



###################################################################################
############################## FAILED TESTS (if any) ##############################
42 tests failed.
FAILED:  org.apache.hadoop.yarn.server.nodemanager.webapp.TestNMWebServices.testInvalidUri

Error Message:
The default test container factory, null, could not be instantiated

Stack Trace:
com.sun.jersey.test.framework.spi.container.TestContainerException: The default test container
factory, null, could not be instantiated
	at com.sun.jersey.test.framework.JerseyTest.getDefaultTestContainerFactory(JerseyTest.java:406)
	at com.sun.jersey.test.framework.JerseyTest.getTestContainerFactory(JerseyTest.java:273)
	at com.sun.jersey.test.framework.JerseyTest.<init>(JerseyTest.java:217)
	at org.apache.hadoop.yarn.server.nodemanager.webapp.TestNMWebServices.<init>(TestNMWebServices.java:171)


FAILED:  org.apache.hadoop.yarn.server.nodemanager.webapp.TestNMWebServices.testInvalidAccept

Error Message:
The default test container factory, null, could not be instantiated

Stack Trace:
com.sun.jersey.test.framework.spi.container.TestContainerException: The default test container
factory, null, could not be instantiated
	at com.sun.jersey.test.framework.JerseyTest.getDefaultTestContainerFactory(JerseyTest.java:406)
	at com.sun.jersey.test.framework.JerseyTest.getTestContainerFactory(JerseyTest.java:273)
	at com.sun.jersey.test.framework.JerseyTest.<init>(JerseyTest.java:217)
	at org.apache.hadoop.yarn.server.nodemanager.webapp.TestNMWebServices.<init>(TestNMWebServices.java:171)


FAILED:  org.apache.hadoop.yarn.server.nodemanager.webapp.TestNMWebServices.testInvalidUri2

Error Message:
The default test container factory, null, could not be instantiated

Stack Trace:
com.sun.jersey.test.framework.spi.container.TestContainerException: The default test container
factory, null, could not be instantiated
	at com.sun.jersey.test.framework.JerseyTest.getDefaultTestContainerFactory(JerseyTest.java:406)
	at com.sun.jersey.test.framework.JerseyTest.getTestContainerFactory(JerseyTest.java:273)
	at com.sun.jersey.test.framework.JerseyTest.<init>(JerseyTest.java:217)
	at org.apache.hadoop.yarn.server.nodemanager.webapp.TestNMWebServices.<init>(TestNMWebServices.java:171)


FAILED:  org.apache.hadoop.yarn.server.nodemanager.webapp.TestNMWebServices.testNode

Error Message:
The default test container factory, null, could not be instantiated

Stack Trace:
com.sun.jersey.test.framework.spi.container.TestContainerException: The default test container
factory, null, could not be instantiated
	at com.sun.jersey.test.framework.JerseyTest.getDefaultTestContainerFactory(JerseyTest.java:406)
	at com.sun.jersey.test.framework.JerseyTest.getTestContainerFactory(JerseyTest.java:273)
	at com.sun.jersey.test.framework.JerseyTest.<init>(JerseyTest.java:217)
	at org.apache.hadoop.yarn.server.nodemanager.webapp.TestNMWebServices.<init>(TestNMWebServices.java:171)


FAILED:  org.apache.hadoop.yarn.server.nodemanager.webapp.TestNMWebServices.testNodeSlash

Error Message:
The default test container factory, null, could not be instantiated

Stack Trace:
com.sun.jersey.test.framework.spi.container.TestContainerException: The default test container
factory, null, could not be instantiated
	at com.sun.jersey.test.framework.JerseyTest.getDefaultTestContainerFactory(JerseyTest.java:406)
	at com.sun.jersey.test.framework.JerseyTest.getTestContainerFactory(JerseyTest.java:273)
	at com.sun.jersey.test.framework.JerseyTest.<init>(JerseyTest.java:217)
	at org.apache.hadoop.yarn.server.nodemanager.webapp.TestNMWebServices.<init>(TestNMWebServices.java:171)


FAILED:  org.apache.hadoop.yarn.server.nodemanager.webapp.TestNMWebServices.testNodeDefault

Error Message:
The default test container factory, null, could not be instantiated

Stack Trace:
com.sun.jersey.test.framework.spi.container.TestContainerException: The default test container
factory, null, could not be instantiated
	at com.sun.jersey.test.framework.JerseyTest.getDefaultTestContainerFactory(JerseyTest.java:406)
	at com.sun.jersey.test.framework.JerseyTest.getTestContainerFactory(JerseyTest.java:273)
	at com.sun.jersey.test.framework.JerseyTest.<init>(JerseyTest.java:217)
	at org.apache.hadoop.yarn.server.nodemanager.webapp.TestNMWebServices.<init>(TestNMWebServices.java:171)


FAILED:  org.apache.hadoop.yarn.server.nodemanager.webapp.TestNMWebServices.testNodeInfo

Error Message:
The default test container factory, null, could not be instantiated

Stack Trace:
com.sun.jersey.test.framework.spi.container.TestContainerException: The default test container
factory, null, could not be instantiated
	at com.sun.jersey.test.framework.JerseyTest.getDefaultTestContainerFactory(JerseyTest.java:406)
	at com.sun.jersey.test.framework.JerseyTest.getTestContainerFactory(JerseyTest.java:273)
	at com.sun.jersey.test.framework.JerseyTest.<init>(JerseyTest.java:217)
	at org.apache.hadoop.yarn.server.nodemanager.webapp.TestNMWebServices.<init>(TestNMWebServices.java:171)


FAILED:  org.apache.hadoop.yarn.server.nodemanager.webapp.TestNMWebServices.testNodeInfoSlash

Error Message:
The default test container factory, null, could not be instantiated

Stack Trace:
com.sun.jersey.test.framework.spi.container.TestContainerException: The default test container
factory, null, could not be instantiated
	at com.sun.jersey.test.framework.JerseyTest.getDefaultTestContainerFactory(JerseyTest.java:406)
	at com.sun.jersey.test.framework.JerseyTest.getTestContainerFactory(JerseyTest.java:273)
	at com.sun.jersey.test.framework.JerseyTest.<init>(JerseyTest.java:217)
	at org.apache.hadoop.yarn.server.nodemanager.webapp.TestNMWebServices.<init>(TestNMWebServices.java:171)


FAILED:  org.apache.hadoop.yarn.server.nodemanager.webapp.TestNMWebServices.testNodeInfoDefault

Error Message:
The default test container factory, null, could not be instantiated

Stack Trace:
com.sun.jersey.test.framework.spi.container.TestContainerException: The default test container
factory, null, could not be instantiated
	at com.sun.jersey.test.framework.JerseyTest.getDefaultTestContainerFactory(JerseyTest.java:406)
	at com.sun.jersey.test.framework.JerseyTest.getTestContainerFactory(JerseyTest.java:273)
	at com.sun.jersey.test.framework.JerseyTest.<init>(JerseyTest.java:217)
	at org.apache.hadoop.yarn.server.nodemanager.webapp.TestNMWebServices.<init>(TestNMWebServices.java:171)


FAILED:  org.apache.hadoop.yarn.server.nodemanager.webapp.TestNMWebServices.testSingleNodesXML

Error Message:
The default test container factory, null, could not be instantiated

Stack Trace:
com.sun.jersey.test.framework.spi.container.TestContainerException: The default test container
factory, null, could not be instantiated
	at com.sun.jersey.test.framework.JerseyTest.getDefaultTestContainerFactory(JerseyTest.java:406)
	at com.sun.jersey.test.framework.JerseyTest.getTestContainerFactory(JerseyTest.java:273)
	at com.sun.jersey.test.framework.JerseyTest.<init>(JerseyTest.java:217)
	at org.apache.hadoop.yarn.server.nodemanager.webapp.TestNMWebServices.<init>(TestNMWebServices.java:171)


FAILED:  org.apache.hadoop.yarn.server.nodemanager.webapp.TestNMWebServices.testContainerLogs

Error Message:
The default test container factory, null, could not be instantiated

Stack Trace:
com.sun.jersey.test.framework.spi.container.TestContainerException: The default test container
factory, null, could not be instantiated
	at com.sun.jersey.test.framework.JerseyTest.getDefaultTestContainerFactory(JerseyTest.java:406)
	at com.sun.jersey.test.framework.JerseyTest.getTestContainerFactory(JerseyTest.java:273)
	at com.sun.jersey.test.framework.JerseyTest.<init>(JerseyTest.java:217)
	at org.apache.hadoop.yarn.server.nodemanager.webapp.TestNMWebServices.<init>(TestNMWebServices.java:171)


FAILED:  org.apache.hadoop.yarn.server.nodemanager.webapp.TestNMWebServicesApps.testNodeAppsNone

Error Message:
The default test container factory, null, could not be instantiated

Stack Trace:
com.sun.jersey.test.framework.spi.container.TestContainerException: The default test container
factory, null, could not be instantiated
	at com.sun.jersey.test.framework.JerseyTest.getDefaultTestContainerFactory(JerseyTest.java:406)
	at com.sun.jersey.test.framework.JerseyTest.getTestContainerFactory(JerseyTest.java:273)
	at com.sun.jersey.test.framework.JerseyTest.<init>(JerseyTest.java:217)
	at org.apache.hadoop.yarn.server.nodemanager.webapp.TestNMWebServicesApps.<init>(TestNMWebServicesApps.java:165)


FAILED:  org.apache.hadoop.yarn.server.nodemanager.webapp.TestNMWebServicesApps.testNodeApps

Error Message:
The default test container factory, null, could not be instantiated

Stack Trace:
com.sun.jersey.test.framework.spi.container.TestContainerException: The default test container
factory, null, could not be instantiated
	at com.sun.jersey.test.framework.JerseyTest.getDefaultTestContainerFactory(JerseyTest.java:406)
	at com.sun.jersey.test.framework.JerseyTest.getTestContainerFactory(JerseyTest.java:273)
	at com.sun.jersey.test.framework.JerseyTest.<init>(JerseyTest.java:217)
	at org.apache.hadoop.yarn.server.nodemanager.webapp.TestNMWebServicesApps.<init>(TestNMWebServicesApps.java:165)


FAILED:  org.apache.hadoop.yarn.server.nodemanager.webapp.TestNMWebServicesApps.testNodeAppsSlash

Error Message:
The default test container factory, null, could not be instantiated

Stack Trace:
com.sun.jersey.test.framework.spi.container.TestContainerException: The default test container
factory, null, could not be instantiated
	at com.sun.jersey.test.framework.JerseyTest.getDefaultTestContainerFactory(JerseyTest.java:406)
	at com.sun.jersey.test.framework.JerseyTest.getTestContainerFactory(JerseyTest.java:273)
	at com.sun.jersey.test.framework.JerseyTest.<init>(JerseyTest.java:217)
	at org.apache.hadoop.yarn.server.nodemanager.webapp.TestNMWebServicesApps.<init>(TestNMWebServicesApps.java:165)


FAILED:  org.apache.hadoop.yarn.server.nodemanager.webapp.TestNMWebServicesApps.testNodeAppsDefault

Error Message:
The default test container factory, null, could not be instantiated

Stack Trace:
com.sun.jersey.test.framework.spi.container.TestContainerException: The default test container
factory, null, could not be instantiated
	at com.sun.jersey.test.framework.JerseyTest.getDefaultTestContainerFactory(JerseyTest.java:406)
	at com.sun.jersey.test.framework.JerseyTest.getTestContainerFactory(JerseyTest.java:273)
	at com.sun.jersey.test.framework.JerseyTest.<init>(JerseyTest.java:217)
	at org.apache.hadoop.yarn.server.nodemanager.webapp.TestNMWebServicesApps.<init>(TestNMWebServicesApps.java:165)


FAILED:  org.apache.hadoop.yarn.server.nodemanager.webapp.TestNMWebServicesApps.testNodeAppsUser

Error Message:
The default test container factory, null, could not be instantiated

Stack Trace:
com.sun.jersey.test.framework.spi.container.TestContainerException: The default test container
factory, null, could not be instantiated
	at com.sun.jersey.test.framework.JerseyTest.getDefaultTestContainerFactory(JerseyTest.java:406)
	at com.sun.jersey.test.framework.JerseyTest.getTestContainerFactory(JerseyTest.java:273)
	at com.sun.jersey.test.framework.JerseyTest.<init>(JerseyTest.java:217)
	at org.apache.hadoop.yarn.server.nodemanager.webapp.TestNMWebServicesApps.<init>(TestNMWebServicesApps.java:165)


FAILED:  org.apache.hadoop.yarn.server.nodemanager.webapp.TestNMWebServicesApps.testNodeAppsUserNone

Error Message:
The default test container factory, null, could not be instantiated

Stack Trace:
com.sun.jersey.test.framework.spi.container.TestContainerException: The default test container
factory, null, could not be instantiated
	at com.sun.jersey.test.framework.JerseyTest.getDefaultTestContainerFactory(JerseyTest.java:406)
	at com.sun.jersey.test.framework.JerseyTest.getTestContainerFactory(JerseyTest.java:273)
	at com.sun.jersey.test.framework.JerseyTest.<init>(JerseyTest.java:217)
	at org.apache.hadoop.yarn.server.nodemanager.webapp.TestNMWebServicesApps.<init>(TestNMWebServicesApps.java:165)


FAILED:  org.apache.hadoop.yarn.server.nodemanager.webapp.TestNMWebServicesApps.testNodeAppsUserEmpty

Error Message:
The default test container factory, null, could not be instantiated

Stack Trace:
com.sun.jersey.test.framework.spi.container.TestContainerException: The default test container
factory, null, could not be instantiated
	at com.sun.jersey.test.framework.JerseyTest.getDefaultTestContainerFactory(JerseyTest.java:406)
	at com.sun.jersey.test.framework.JerseyTest.getTestContainerFactory(JerseyTest.java:273)
	at com.sun.jersey.test.framework.JerseyTest.<init>(JerseyTest.java:217)
	at org.apache.hadoop.yarn.server.nodemanager.webapp.TestNMWebServicesApps.<init>(TestNMWebServicesApps.java:165)


FAILED:  org.apache.hadoop.yarn.server.nodemanager.webapp.TestNMWebServicesApps.testNodeAppsState

Error Message:
The default test container factory, null, could not be instantiated

Stack Trace:
com.sun.jersey.test.framework.spi.container.TestContainerException: The default test container
factory, null, could not be instantiated
	at com.sun.jersey.test.framework.JerseyTest.getDefaultTestContainerFactory(JerseyTest.java:406)
	at com.sun.jersey.test.framework.JerseyTest.getTestContainerFactory(JerseyTest.java:273)
	at com.sun.jersey.test.framework.JerseyTest.<init>(JerseyTest.java:217)
	at org.apache.hadoop.yarn.server.nodemanager.webapp.TestNMWebServicesApps.<init>(TestNMWebServicesApps.java:165)


FAILED:  org.apache.hadoop.yarn.server.nodemanager.webapp.TestNMWebServicesApps.testNodeAppsStateNone

Error Message:
The default test container factory, null, could not be instantiated

Stack Trace:
com.sun.jersey.test.framework.spi.container.TestContainerException: The default test container
factory, null, could not be instantiated
	at com.sun.jersey.test.framework.JerseyTest.getDefaultTestContainerFactory(JerseyTest.java:406)
	at com.sun.jersey.test.framework.JerseyTest.getTestContainerFactory(JerseyTest.java:273)
	at com.sun.jersey.test.framework.JerseyTest.<init>(JerseyTest.java:217)
	at org.apache.hadoop.yarn.server.nodemanager.webapp.TestNMWebServicesApps.<init>(TestNMWebServicesApps.java:165)


FAILED:  org.apache.hadoop.yarn.server.nodemanager.webapp.TestNMWebServicesApps.testNodeAppsStateInvalid

Error Message:
The default test container factory, null, could not be instantiated

Stack Trace:
com.sun.jersey.test.framework.spi.container.TestContainerException: The default test container
factory, null, could not be instantiated
	at com.sun.jersey.test.framework.JerseyTest.getDefaultTestContainerFactory(JerseyTest.java:406)
	at com.sun.jersey.test.framework.JerseyTest.getTestContainerFactory(JerseyTest.java:273)
	at com.sun.jersey.test.framework.JerseyTest.<init>(JerseyTest.java:217)
	at org.apache.hadoop.yarn.server.nodemanager.webapp.TestNMWebServicesApps.<init>(TestNMWebServicesApps.java:165)


FAILED:  org.apache.hadoop.yarn.server.nodemanager.webapp.TestNMWebServicesApps.testNodeAppsStateInvalidDefault

Error Message:
The default test container factory, null, could not be instantiated

Stack Trace:
com.sun.jersey.test.framework.spi.container.TestContainerException: The default test container
factory, null, could not be instantiated
	at com.sun.jersey.test.framework.JerseyTest.getDefaultTestContainerFactory(JerseyTest.java:406)
	at com.sun.jersey.test.framework.JerseyTest.getTestContainerFactory(JerseyTest.java:273)
	at com.sun.jersey.test.framework.JerseyTest.<init>(JerseyTest.java:217)
	at org.apache.hadoop.yarn.server.nodemanager.webapp.TestNMWebServicesApps.<init>(TestNMWebServicesApps.java:165)


FAILED:  org.apache.hadoop.yarn.server.nodemanager.webapp.TestNMWebServicesApps.testNodeAppsStateInvalidXML

Error Message:
The default test container factory, null, could not be instantiated

Stack Trace:
com.sun.jersey.test.framework.spi.container.TestContainerException: The default test container
factory, null, could not be instantiated
	at com.sun.jersey.test.framework.JerseyTest.getDefaultTestContainerFactory(JerseyTest.java:406)
	at com.sun.jersey.test.framework.JerseyTest.getTestContainerFactory(JerseyTest.java:273)
	at com.sun.jersey.test.framework.JerseyTest.<init>(JerseyTest.java:217)
	at org.apache.hadoop.yarn.server.nodemanager.webapp.TestNMWebServicesApps.<init>(TestNMWebServicesApps.java:165)


FAILED:  org.apache.hadoop.yarn.server.nodemanager.webapp.TestNMWebServicesApps.testNodeSingleApps

Error Message:
The default test container factory, null, could not be instantiated

Stack Trace:
com.sun.jersey.test.framework.spi.container.TestContainerException: The default test container
factory, null, could not be instantiated
	at com.sun.jersey.test.framework.JerseyTest.getDefaultTestContainerFactory(JerseyTest.java:406)
	at com.sun.jersey.test.framework.JerseyTest.getTestContainerFactory(JerseyTest.java:273)
	at com.sun.jersey.test.framework.JerseyTest.<init>(JerseyTest.java:217)
	at org.apache.hadoop.yarn.server.nodemanager.webapp.TestNMWebServicesApps.<init>(TestNMWebServicesApps.java:165)


FAILED:  org.apache.hadoop.yarn.server.nodemanager.webapp.TestNMWebServicesApps.testNodeSingleAppsDefault

Error Message:
The default test container factory, null, could not be instantiated

Stack Trace:
com.sun.jersey.test.framework.spi.container.TestContainerException: The default test container
factory, null, could not be instantiated
	at com.sun.jersey.test.framework.JerseyTest.getDefaultTestContainerFactory(JerseyTest.java:406)
	at com.sun.jersey.test.framework.JerseyTest.getTestContainerFactory(JerseyTest.java:273)
	at com.sun.jersey.test.framework.JerseyTest.<init>(JerseyTest.java:217)
	at org.apache.hadoop.yarn.server.nodemanager.webapp.TestNMWebServicesApps.<init>(TestNMWebServicesApps.java:165)


FAILED:  org.apache.hadoop.yarn.server.nodemanager.webapp.TestNMWebServicesApps.testNodeSingleAppsSlash

Error Message:
The default test container factory, null, could not be instantiated

Stack Trace:
com.sun.jersey.test.framework.spi.container.TestContainerException: The default test container
factory, null, could not be instantiated
	at com.sun.jersey.test.framework.JerseyTest.getDefaultTestContainerFactory(JerseyTest.java:406)
	at com.sun.jersey.test.framework.JerseyTest.getTestContainerFactory(JerseyTest.java:273)
	at com.sun.jersey.test.framework.JerseyTest.<init>(JerseyTest.java:217)
	at org.apache.hadoop.yarn.server.nodemanager.webapp.TestNMWebServicesApps.<init>(TestNMWebServicesApps.java:165)


FAILED:  org.apache.hadoop.yarn.server.nodemanager.webapp.TestNMWebServicesApps.testNodeSingleAppsInvalid

Error Message:
The default test container factory, null, could not be instantiated

Stack Trace:
com.sun.jersey.test.framework.spi.container.TestContainerException: The default test container
factory, null, could not be instantiated
	at com.sun.jersey.test.framework.JerseyTest.getDefaultTestContainerFactory(JerseyTest.java:406)
	at com.sun.jersey.test.framework.JerseyTest.getTestContainerFactory(JerseyTest.java:273)
	at com.sun.jersey.test.framework.JerseyTest.<init>(JerseyTest.java:217)
	at org.apache.hadoop.yarn.server.nodemanager.webapp.TestNMWebServicesApps.<init>(TestNMWebServicesApps.java:165)


FAILED:  org.apache.hadoop.yarn.server.nodemanager.webapp.TestNMWebServicesApps.testNodeSingleAppsMissing

Error Message:
The default test container factory, null, could not be instantiated

Stack Trace:
com.sun.jersey.test.framework.spi.container.TestContainerException: The default test container
factory, null, could not be instantiated
	at com.sun.jersey.test.framework.JerseyTest.getDefaultTestContainerFactory(JerseyTest.java:406)
	at com.sun.jersey.test.framework.JerseyTest.getTestContainerFactory(JerseyTest.java:273)
	at com.sun.jersey.test.framework.JerseyTest.<init>(JerseyTest.java:217)
	at org.apache.hadoop.yarn.server.nodemanager.webapp.TestNMWebServicesApps.<init>(TestNMWebServicesApps.java:165)


FAILED:  org.apache.hadoop.yarn.server.nodemanager.webapp.TestNMWebServicesApps.testNodeAppsXML

Error Message:
The default test container factory, null, could not be instantiated

Stack Trace:
com.sun.jersey.test.framework.spi.container.TestContainerException: The default test container
factory, null, could not be instantiated
	at com.sun.jersey.test.framework.JerseyTest.getDefaultTestContainerFactory(JerseyTest.java:406)
	at com.sun.jersey.test.framework.JerseyTest.getTestContainerFactory(JerseyTest.java:273)
	at com.sun.jersey.test.framework.JerseyTest.<init>(JerseyTest.java:217)
	at org.apache.hadoop.yarn.server.nodemanager.webapp.TestNMWebServicesApps.<init>(TestNMWebServicesApps.java:165)


FAILED:  org.apache.hadoop.yarn.server.nodemanager.webapp.TestNMWebServicesApps.testNodeSingleAppsXML

Error Message:
The default test container factory, null, could not be instantiated

Stack Trace:
com.sun.jersey.test.framework.spi.container.TestContainerException: The default test container
factory, null, could not be instantiated
	at com.sun.jersey.test.framework.JerseyTest.getDefaultTestContainerFactory(JerseyTest.java:406)
	at com.sun.jersey.test.framework.JerseyTest.getTestContainerFactory(JerseyTest.java:273)
	at com.sun.jersey.test.framework.JerseyTest.<init>(JerseyTest.java:217)
	at org.apache.hadoop.yarn.server.nodemanager.webapp.TestNMWebServicesApps.<init>(TestNMWebServicesApps.java:165)


FAILED:  org.apache.hadoop.yarn.server.nodemanager.webapp.TestNMWebServicesContainers.testNodeContainersNone

Error Message:
The default test container factory, null, could not be instantiated

Stack Trace:
com.sun.jersey.test.framework.spi.container.TestContainerException: The default test container
factory, null, could not be instantiated
	at com.sun.jersey.test.framework.JerseyTest.getDefaultTestContainerFactory(JerseyTest.java:406)
	at com.sun.jersey.test.framework.JerseyTest.getTestContainerFactory(JerseyTest.java:273)
	at com.sun.jersey.test.framework.JerseyTest.<init>(JerseyTest.java:217)
	at org.apache.hadoop.yarn.server.nodemanager.webapp.TestNMWebServicesContainers.<init>(TestNMWebServicesContainers.java:171)


FAILED:  org.apache.hadoop.yarn.server.nodemanager.webapp.TestNMWebServicesContainers.testNodeContainers

Error Message:
The default test container factory, null, could not be instantiated

Stack Trace:
com.sun.jersey.test.framework.spi.container.TestContainerException: The default test container
factory, null, could not be instantiated
	at com.sun.jersey.test.framework.JerseyTest.getDefaultTestContainerFactory(JerseyTest.java:406)
	at com.sun.jersey.test.framework.JerseyTest.getTestContainerFactory(JerseyTest.java:273)
	at com.sun.jersey.test.framework.JerseyTest.<init>(JerseyTest.java:217)
	at org.apache.hadoop.yarn.server.nodemanager.webapp.TestNMWebServicesContainers.<init>(TestNMWebServicesContainers.java:171)


FAILED:  org.apache.hadoop.yarn.server.nodemanager.webapp.TestNMWebServicesContainers.testNodeContainersSlash

Error Message:
The default test container factory, null, could not be instantiated

Stack Trace:
com.sun.jersey.test.framework.spi.container.TestContainerException: The default test container
factory, null, could not be instantiated
	at com.sun.jersey.test.framework.JerseyTest.getDefaultTestContainerFactory(JerseyTest.java:406)
	at com.sun.jersey.test.framework.JerseyTest.getTestContainerFactory(JerseyTest.java:273)
	at com.sun.jersey.test.framework.JerseyTest.<init>(JerseyTest.java:217)
	at org.apache.hadoop.yarn.server.nodemanager.webapp.TestNMWebServicesContainers.<init>(TestNMWebServicesContainers.java:171)


FAILED:  org.apache.hadoop.yarn.server.nodemanager.webapp.TestNMWebServicesContainers.testNodeContainersDefault

Error Message:
The default test container factory, null, could not be instantiated

Stack Trace:
com.sun.jersey.test.framework.spi.container.TestContainerException: The default test container
factory, null, could not be instantiated
	at com.sun.jersey.test.framework.JerseyTest.getDefaultTestContainerFactory(JerseyTest.java:406)
	at com.sun.jersey.test.framework.JerseyTest.getTestContainerFactory(JerseyTest.java:273)
	at com.sun.jersey.test.framework.JerseyTest.<init>(JerseyTest.java:217)
	at org.apache.hadoop.yarn.server.nodemanager.webapp.TestNMWebServicesContainers.<init>(TestNMWebServicesContainers.java:171)


FAILED:  org.apache.hadoop.yarn.server.nodemanager.webapp.TestNMWebServicesContainers.testNodeSingleContainers

Error Message:
The default test container factory, null, could not be instantiated

Stack Trace:
com.sun.jersey.test.framework.spi.container.TestContainerException: The default test container
factory, null, could not be instantiated
	at com.sun.jersey.test.framework.JerseyTest.getDefaultTestContainerFactory(JerseyTest.java:406)
	at com.sun.jersey.test.framework.JerseyTest.getTestContainerFactory(JerseyTest.java:273)
	at com.sun.jersey.test.framework.JerseyTest.<init>(JerseyTest.java:217)
	at org.apache.hadoop.yarn.server.nodemanager.webapp.TestNMWebServicesContainers.<init>(TestNMWebServicesContainers.java:171)


FAILED:  org.apache.hadoop.yarn.server.nodemanager.webapp.TestNMWebServicesContainers.testNodeSingleContainersSlash

Error Message:
The default test container factory, null, could not be instantiated

Stack Trace:
com.sun.jersey.test.framework.spi.container.TestContainerException: The default test container
factory, null, could not be instantiated
	at com.sun.jersey.test.framework.JerseyTest.getDefaultTestContainerFactory(JerseyTest.java:406)
	at com.sun.jersey.test.framework.JerseyTest.getTestContainerFactory(JerseyTest.java:273)
	at com.sun.jersey.test.framework.JerseyTest.<init>(JerseyTest.java:217)
	at org.apache.hadoop.yarn.server.nodemanager.webapp.TestNMWebServicesContainers.<init>(TestNMWebServicesContainers.java:171)


FAILED:  org.apache.hadoop.yarn.server.nodemanager.webapp.TestNMWebServicesContainers.testNodeSingleContainersDefault

Error Message:
The default test container factory, null, could not be instantiated

Stack Trace:
com.sun.jersey.test.framework.spi.container.TestContainerException: The default test container
factory, null, could not be instantiated
	at com.sun.jersey.test.framework.JerseyTest.getDefaultTestContainerFactory(JerseyTest.java:406)
	at com.sun.jersey.test.framework.JerseyTest.getTestContainerFactory(JerseyTest.java:273)
	at com.sun.jersey.test.framework.JerseyTest.<init>(JerseyTest.java:217)
	at org.apache.hadoop.yarn.server.nodemanager.webapp.TestNMWebServicesContainers.<init>(TestNMWebServicesContainers.java:171)


FAILED:  org.apache.hadoop.yarn.server.nodemanager.webapp.TestNMWebServicesContainers.testSingleContainerInvalid

Error Message:
The default test container factory, null, could not be instantiated

Stack Trace:
com.sun.jersey.test.framework.spi.container.TestContainerException: The default test container
factory, null, could not be instantiated
	at com.sun.jersey.test.framework.JerseyTest.getDefaultTestContainerFactory(JerseyTest.java:406)
	at com.sun.jersey.test.framework.JerseyTest.getTestContainerFactory(JerseyTest.java:273)
	at com.sun.jersey.test.framework.JerseyTest.<init>(JerseyTest.java:217)
	at org.apache.hadoop.yarn.server.nodemanager.webapp.TestNMWebServicesContainers.<init>(TestNMWebServicesContainers.java:171)


FAILED:  org.apache.hadoop.yarn.server.nodemanager.webapp.TestNMWebServicesContainers.testSingleContainerInvalid2

Error Message:
The default test container factory, null, could not be instantiated

Stack Trace:
com.sun.jersey.test.framework.spi.container.TestContainerException: The default test container
factory, null, could not be instantiated
	at com.sun.jersey.test.framework.JerseyTest.getDefaultTestContainerFactory(JerseyTest.java:406)
	at com.sun.jersey.test.framework.JerseyTest.getTestContainerFactory(JerseyTest.java:273)
	at com.sun.jersey.test.framework.JerseyTest.<init>(JerseyTest.java:217)
	at org.apache.hadoop.yarn.server.nodemanager.webapp.TestNMWebServicesContainers.<init>(TestNMWebServicesContainers.java:171)


FAILED:  org.apache.hadoop.yarn.server.nodemanager.webapp.TestNMWebServicesContainers.testSingleContainerWrong

Error Message:
The default test container factory, null, could not be instantiated

Stack Trace:
com.sun.jersey.test.framework.spi.container.TestContainerException: The default test container
factory, null, could not be instantiated
	at com.sun.jersey.test.framework.JerseyTest.getDefaultTestContainerFactory(JerseyTest.java:406)
	at com.sun.jersey.test.framework.JerseyTest.getTestContainerFactory(JerseyTest.java:273)
	at com.sun.jersey.test.framework.JerseyTest.<init>(JerseyTest.java:217)
	at org.apache.hadoop.yarn.server.nodemanager.webapp.TestNMWebServicesContainers.<init>(TestNMWebServicesContainers.java:171)


FAILED:  org.apache.hadoop.yarn.server.nodemanager.webapp.TestNMWebServicesContainers.testNodeSingleContainerXML

Error Message:
The default test container factory, null, could not be instantiated

Stack Trace:
com.sun.jersey.test.framework.spi.container.TestContainerException: The default test container
factory, null, could not be instantiated
	at com.sun.jersey.test.framework.JerseyTest.getDefaultTestContainerFactory(JerseyTest.java:406)
	at com.sun.jersey.test.framework.JerseyTest.getTestContainerFactory(JerseyTest.java:273)
	at com.sun.jersey.test.framework.JerseyTest.<init>(JerseyTest.java:217)
	at org.apache.hadoop.yarn.server.nodemanager.webapp.TestNMWebServicesContainers.<init>(TestNMWebServicesContainers.java:171)


FAILED:  org.apache.hadoop.yarn.server.nodemanager.webapp.TestNMWebServicesContainers.testNodeContainerXML

Error Message:
The default test container factory, null, could not be instantiated

Stack Trace:
com.sun.jersey.test.framework.spi.container.TestContainerException: The default test container
factory, null, could not be instantiated
	at com.sun.jersey.test.framework.JerseyTest.getDefaultTestContainerFactory(JerseyTest.java:406)
	at com.sun.jersey.test.framework.JerseyTest.getTestContainerFactory(JerseyTest.java:273)
	at com.sun.jersey.test.framework.JerseyTest.<init>(JerseyTest.java:217)
	at org.apache.hadoop.yarn.server.nodemanager.webapp.TestNMWebServicesContainers.<init>(TestNMWebServicesContainers.java:171)



Mime
  • Unnamed multipart/mixed (inline, None, 0 bytes)
View raw message