hadoop-yarn-dev mailing list archives

Site index · List index
Message view « Date » · « Thread »
Top « Date » · « Thread »
From Apache Jenkins Server <jenk...@builds.apache.org>
Subject Failed: YARN-1635 PreCommit Build #3036
Date Thu, 06 Feb 2014 23:59:22 GMT
Jira: https://issues.apache.org/jira/browse/YARN-1635
Build: https://builds.apache.org/job/PreCommit-YARN-Build/3036/

###################################################################################
########################## LAST 60 LINES OF THE CONSOLE ###########################
[...truncated 3159 lines...]
NOP




{color:red}-1 overall{color}.  Here are the results of testing the latest attachment 
  http://issues.apache.org/jira/secure/attachment/12627500/YARN-1635.11.patch
  against trunk revision .

    {color:green}+1 @author{color}.  The patch does not contain any @author tags.

    {color:green}+1 tests included{color}.  The patch appears to include 6 new or modified
test files.

    {color:green}+1 javac{color}.  The applied patch does not increase the total number of
javac compiler warnings.

    {color:green}+1 javadoc{color}.  There were no new javadoc warning messages.

    {color:green}+1 eclipse:eclipse{color}.  The patch built with eclipse:eclipse.

    {color:green}+1 findbugs{color}.  The patch does not introduce any new Findbugs (version
1.3.9) warnings.

    {color:green}+1 release audit{color}.  The applied patch does not increase the total number
of release audit warnings.

    {color:red}-1 core tests{color}.  The patch failed these unit tests in hadoop-yarn-project/hadoop-yarn/hadoop-yarn-api
hadoop-yarn-project/hadoop-yarn/hadoop-yarn-common hadoop-yarn-project/hadoop-yarn/hadoop-yarn-server/hadoop-yarn-server-applicationhistoryservice:

                  org.apache.hadoop.yarn.server.applicationhistoryservice.apptimeline.TestLeveldbApplicationTimelineStore

    {color:green}+1 contrib tests{color}.  The patch passed contrib unit tests.

Test results: https://builds.apache.org/job/PreCommit-YARN-Build/3036//testReport/
Console output: https://builds.apache.org/job/PreCommit-YARN-Build/3036//console

This message is automatically generated.


======================================================================
======================================================================
    Adding comment to Jira.
======================================================================
======================================================================


Comment added.
dd163d7d2216696f513d3b428f7508b941948926 logged out


======================================================================
======================================================================
    Finished build.
======================================================================
======================================================================


Build step 'Execute shell' marked build as failure
Archiving artifacts
[description-setter] Could not determine description.
Recording test results
Email was triggered for: Failure
Sending email for trigger: Failure



###################################################################################
############################## FAILED TESTS (if any) ##############################
1 tests failed.
FAILED:  org.apache.hadoop.yarn.server.applicationhistoryservice.apptimeline.TestLeveldbApplicationTimelineStore.testErrors

Error Message:
null

Stack Trace:
java.lang.NullPointerException: null
	at org.apache.hadoop.yarn.server.applicationhistoryservice.apptimeline.LeveldbApplicationTimelineStore.put(LeveldbApplicationTimelineStore.java:534)
	at org.apache.hadoop.yarn.server.applicationhistoryservice.apptimeline.LeveldbApplicationTimelineStore.put(LeveldbApplicationTimelineStore.java:651)
	at org.apache.hadoop.yarn.server.applicationhistoryservice.apptimeline.TestLeveldbApplicationTimelineStore.testErrors(TestLeveldbApplicationTimelineStore.java:104)



Mime
  • Unnamed multipart/mixed (inline, None, 0 bytes)
View raw message