hadoop-yarn-dev mailing list archives

Site index · List index
Message view « Date » · « Thread »
Top « Date » · « Thread »
From Apache Jenkins Server <jenk...@builds.apache.org>
Subject Failed: YARN-1553 PreCommit Build #2996
Date Tue, 04 Feb 2014 01:16:13 GMT
Jira: https://issues.apache.org/jira/browse/YARN-1553
Build: https://builds.apache.org/job/PreCommit-YARN-Build/2996/

###################################################################################
########################## LAST 60 LINES OF THE CONSOLE ###########################
[...truncated 5865 lines...]




{color:red}-1 overall{color}.  Here are the results of testing the latest attachment 
  http://issues.apache.org/jira/secure/attachment/12626753/YARN-1553.003.patch
  against trunk revision .

    {color:green}+1 @author{color}.  The patch does not contain any @author tags.

    {color:green}+1 tests included{color}.  The patch appears to include 9 new or modified
test files.

    {color:green}+1 javac{color}.  The applied patch does not increase the total number of
javac compiler warnings.

    {color:green}+1 javadoc{color}.  The javadoc tool did not generate any warning messages.

    {color:green}+1 eclipse:eclipse{color}.  The patch built with eclipse:eclipse.

    {color:red}-1 findbugs{color}.  The patch appears to introduce 1 new Findbugs (version
1.3.9) warnings.

    {color:green}+1 release audit{color}.  The applied patch does not increase the total number
of release audit warnings.

    {color:red}-1 core tests{color}.  The patch failed these unit tests in hadoop-common-project/hadoop-common
hadoop-mapreduce-project/hadoop-mapreduce-client/hadoop-mapreduce-client-app hadoop-mapreduce-project/hadoop-mapreduce-client/hadoop-mapreduce-client-common
hadoop-mapreduce-project/hadoop-mapreduce-client/hadoop-mapreduce-client-core hadoop-mapreduce-project/hadoop-mapreduce-client/hadoop-mapreduce-client-hs
hadoop-mapreduce-project/hadoop-mapreduce-client/hadoop-mapreduce-client-jobclient hadoop-yarn-project/hadoop-yarn/hadoop-yarn-api
hadoop-yarn-project/hadoop-yarn/hadoop-yarn-common hadoop-yarn-project/hadoop-yarn/hadoop-yarn-server/hadoop-yarn-server-common
hadoop-yarn-project/hadoop-yarn/hadoop-yarn-server/hadoop-yarn-server-nodemanager hadoop-yarn-project/hadoop-yarn/hadoop-yarn-server/hadoop-yarn-server-resourcemanager
hadoop-yarn-project/hadoop-yarn/hadoop-yarn-server/hadoop-yarn-server-tests hadoop-yarn-project/hadoop-yarn/hadoop-yarn-server/hadoop-yarn-server-web-proxy:

                  org.apache.hadoop.mapreduce.v2.app.TestRMContainerAllocator

    {color:green}+1 contrib tests{color}.  The patch passed contrib unit tests.

Test results: https://builds.apache.org/job/PreCommit-YARN-Build/2996//testReport/
Findbugs warnings: https://builds.apache.org/job/PreCommit-YARN-Build/2996//artifact/trunk/patchprocess/newPatchFindbugsWarningshadoop-yarn-server-resourcemanager.html
Console output: https://builds.apache.org/job/PreCommit-YARN-Build/2996//console

This message is automatically generated.


======================================================================
======================================================================
    Adding comment to Jira.
======================================================================
======================================================================


Comment added.
ce6ba3c05e90474854e7389714aa4b1df3e8db3b logged out


======================================================================
======================================================================
    Finished build.
======================================================================
======================================================================


Build step 'Execute shell' marked build as failure
Archiving artifacts
[description-setter] Could not determine description.
Recording test results
Email was triggered for: Failure
Sending email for trigger: Failure



###################################################################################
############################## FAILED TESTS (if any) ##############################
1 tests failed.
FAILED:  org.apache.hadoop.mapreduce.v2.app.TestRMContainerAllocator.testCompletedTasksRecalculateSchedule

Error Message:
java.lang.NullPointerException

Stack Trace:
org.apache.hadoop.yarn.exceptions.YarnRuntimeException: java.lang.NullPointerException
	at org.apache.hadoop.yarn.server.resourcemanager.scheduler.AbstractYarnScheduler.getTransferredContainers(AbstractYarnScheduler.java:51)
	at org.apache.hadoop.yarn.server.resourcemanager.ApplicationMasterService.registerApplicationMaster(ApplicationMasterService.java:278)
	at org.apache.hadoop.mapreduce.v2.app.rm.RMCommunicator.register(RMCommunicator.java:154)
	at org.apache.hadoop.mapreduce.v2.app.TestRMContainerAllocator$MyContainerAllocator.register(TestRMContainerAllocator.java:1476)
	at org.apache.hadoop.mapreduce.v2.app.rm.RMCommunicator.serviceStart(RMCommunicator.java:115)
	at org.apache.hadoop.mapreduce.v2.app.rm.RMContainerAllocator.serviceStart(RMContainerAllocator.java:219)
	at org.apache.hadoop.service.AbstractService.start(AbstractService.java:193)
	at org.apache.hadoop.mapreduce.v2.app.TestRMContainerAllocator$MyContainerAllocator.<init>(TestRMContainerAllocator.java:1444)
	at org.apache.hadoop.mapreduce.v2.app.TestRMContainerAllocator$RecalculateContainerAllocator.<init>(TestRMContainerAllocator.java:1629)
	at org.apache.hadoop.mapreduce.v2.app.TestRMContainerAllocator.testCompletedTasksRecalculateSchedule(TestRMContainerAllocator.java:1665)



Mime
  • Unnamed multipart/mixed (inline, None, 0 bytes)
View raw message