hadoop-yarn-dev mailing list archives

Site index · List index
Message view « Date » · « Thread »
Top « Date » · « Thread »
From Apache Jenkins Server <jenk...@builds.apache.org>
Subject Failed: YARN-1636 PreCommit Build #3017
Date Wed, 05 Feb 2014 02:20:42 GMT
Jira: https://issues.apache.org/jira/browse/YARN-1636
Build: https://builds.apache.org/job/PreCommit-YARN-Build/3017/

###################################################################################
########################## LAST 60 LINES OF THE CONSOLE ###########################
[...truncated 3704 lines...]



{color:red}-1 overall{color}.  Here are the results of testing the latest attachment 
  http://issues.apache.org/jira/secure/attachment/12627044/YARN-1636.2.patch
  against trunk revision .

    {color:green}+1 @author{color}.  The patch does not contain any @author tags.

    {color:green}+1 tests included{color}.  The patch appears to include 1 new or modified
test files.

    {color:green}+1 javac{color}.  The applied patch does not increase the total number of
javac compiler warnings.

    {color:red}-1 javadoc{color}.  The javadoc tool appears to have generated 2 warning messages.

    {color:green}+1 eclipse:eclipse{color}.  The patch built with eclipse:eclipse.

    {color:green}+1 findbugs{color}.  The patch does not introduce any new Findbugs (version
1.3.9) warnings.

    {color:green}+1 release audit{color}.  The applied patch does not increase the total number
of release audit warnings.

    {color:red}-1 core tests{color}.  The patch failed these unit tests in hadoop-yarn-project/hadoop-yarn/hadoop-yarn-api
hadoop-yarn-project/hadoop-yarn/hadoop-yarn-common hadoop-yarn-project/hadoop-yarn/hadoop-yarn-server/hadoop-yarn-server-applicationhistoryservice:

                  org.apache.hadoop.yarn.server.applicationhistoryservice.TestApplicationHistoryServer

    {color:green}+1 contrib tests{color}.  The patch passed contrib unit tests.

Test results: https://builds.apache.org/job/PreCommit-YARN-Build/3017//testReport/
Console output: https://builds.apache.org/job/PreCommit-YARN-Build/3017//console

This message is automatically generated.


======================================================================
======================================================================
    Adding comment to Jira.
======================================================================
======================================================================


Comment added.
d133006cf8a5dda175b366bbe6ec2e63971f65cb logged out


======================================================================
======================================================================
    Finished build.
======================================================================
======================================================================


Build step 'Execute shell' marked build as failure
Archiving artifacts
[description-setter] Could not determine description.
Recording test results
Publish JUnit test result report is waiting for a checkpoint on PreCommit-YARN-Build #3016
Editable Email Notification is waiting for a checkpoint on PreCommit-YARN-Build #3016
Email was triggered for: Failure
Sending email for trigger: Failure



###################################################################################
############################## FAILED TESTS (if any) ##############################
1 tests failed.
FAILED:  org.apache.hadoop.yarn.server.applicationhistoryservice.TestApplicationHistoryServer.testStartStopServer

Error Message:
expected:<2> but was:<3>

Stack Trace:
java.lang.AssertionError: expected:<2> but was:<3>
	at org.junit.Assert.fail(Assert.java:93)
	at org.junit.Assert.failNotEquals(Assert.java:647)
	at org.junit.Assert.assertEquals(Assert.java:128)
	at org.junit.Assert.assertEquals(Assert.java:472)
	at org.junit.Assert.assertEquals(Assert.java:456)
	at org.apache.hadoop.yarn.server.applicationhistoryservice.TestApplicationHistoryServer.testStartStopServer(TestApplicationHistoryServer.java:43)



Mime
  • Unnamed multipart/mixed (inline, None, 0 bytes)
View raw message