hadoop-yarn-dev mailing list archives

Site index · List index
Message view « Date » · « Thread »
Top « Date » · « Thread »
From Apache Jenkins Server <jenk...@builds.apache.org>
Subject Hadoop-Yarn-trunk - Build # 482 - Failure
Date Sat, 15 Feb 2014 11:09:15 GMT
See https://builds.apache.org/job/Hadoop-Yarn-trunk/482/

###################################################################################
########################## LAST 60 LINES OF THE CONSOLE ###########################
[...truncated 15864 lines...]
Tests run: 13, Failures: 0, Errors: 0, Skipped: 0, Time elapsed: 0.595 sec - in org.apache.hadoop.yarn.client.TestRMAdminCLI

Results :

Tests run: 94, Failures: 0, Errors: 0, Skipped: 0

[INFO] ------------------------------------------------------------------------
[INFO] Reactor Summary:
[INFO] 
[INFO] hadoop-yarn ....................................... SUCCESS [2.672s]
[INFO] hadoop-yarn-api ................................... SUCCESS [3:07.508s]
[INFO] hadoop-yarn-common ................................ SUCCESS [2:11.133s]
[INFO] hadoop-yarn-server ................................ SUCCESS [0.070s]
[INFO] hadoop-yarn-server-common ......................... SUCCESS [34.788s]
[INFO] hadoop-yarn-server-nodemanager .................... SUCCESS [4:30.015s]
[INFO] hadoop-yarn-server-web-proxy ...................... SUCCESS [18.600s]
[INFO] hadoop-yarn-server-applicationhistoryservice ...... SUCCESS [1:07.394s]
[INFO] hadoop-yarn-server-resourcemanager ................ SUCCESS [17:53.543s]
[INFO] hadoop-yarn-server-tests .......................... SUCCESS [1:20.722s]
[INFO] hadoop-yarn-client ................................ FAILURE [3:34.792s]
[INFO] hadoop-yarn-applications .......................... SKIPPED
[INFO] hadoop-yarn-applications-distributedshell ......... SKIPPED
[INFO] hadoop-yarn-applications-unmanaged-am-launcher .... SKIPPED
[INFO] hadoop-yarn-site .................................. SKIPPED
[INFO] hadoop-yarn-project ............................... SKIPPED
[INFO] ------------------------------------------------------------------------
[INFO] BUILD FAILURE
[INFO] ------------------------------------------------------------------------
[INFO] Total time: 34:43.243s
[INFO] Finished at: Sat Feb 15 11:09:10 UTC 2014
[INFO] Final Memory: 61M/785M
[INFO] ------------------------------------------------------------------------
[ERROR] Failed to execute goal org.apache.maven.plugins:maven-surefire-plugin:2.16:test (default-test)
on project hadoop-yarn-client: ExecutionException; nested exception is java.util.concurrent.ExecutionException:
java.lang.RuntimeException: The forked VM terminated without saying properly goodbye. VM crash
or System.exit called ?
[ERROR] Command was/bin/sh -c cd /home/jenkins/jenkins-slave/workspace/Hadoop-Yarn-trunk/trunk/hadoop-yarn-project/hadoop-yarn/hadoop-yarn-client
&& /home/jenkins/tools/java/jdk1.6.0_27/jre/bin/java -Xmx1024m -XX:+HeapDumpOnOutOfMemoryError
-jar /home/jenkins/jenkins-slave/workspace/Hadoop-Yarn-trunk/trunk/hadoop-yarn-project/hadoop-yarn/hadoop-yarn-client/target/surefire/surefirebooter3288687606633642530.jar
/home/jenkins/jenkins-slave/workspace/Hadoop-Yarn-trunk/trunk/hadoop-yarn-project/hadoop-yarn/hadoop-yarn-client/target/surefire/surefire4922690245467860069tmp
/home/jenkins/jenkins-slave/workspace/Hadoop-Yarn-trunk/trunk/hadoop-yarn-project/hadoop-yarn/hadoop-yarn-client/target/surefire/surefire_1934503041249507202555tmp
[ERROR] -> [Help 1]
[ERROR] 
[ERROR] To see the full stack trace of the errors, re-run Maven with the -e switch.
[ERROR] Re-run Maven using the -X switch to enable full debug logging.
[ERROR] 
[ERROR] For more information about the errors and possible solutions, please read the following
articles:
[ERROR] [Help 1] http://cwiki.apache.org/confluence/display/MAVEN/MojoFailureException
[ERROR] 
[ERROR] After correcting the problems, you can resume the build with the command
[ERROR]   mvn <goals> -rf :hadoop-yarn-client
Build step 'Execute shell' marked build as failure
Archiving artifacts
Updating HDFS-3128
Updating HDFS-5943
Updating HDFS-5953
Updating HDFS-5749
Updating HDFS-5698
Updating YARN-1553
Updating HDFS-5949
Updating HDFS-5716
Updating HDFS-5948
Updating HADOOP-10342
Sending e-mails to: yarn-dev@hadoop.apache.org
Email was triggered for: Failure
Sending email for trigger: Failure



###################################################################################
############################## FAILED TESTS (if any) ##############################
No tests ran.
Mime
  • Unnamed multipart/mixed (inline, None, 0 bytes)
View raw message