hadoop-yarn-dev mailing list archives

Site index · List index
Message view « Date » · « Thread »
Top « Date » · « Thread »
From Apache Jenkins Server <jenk...@builds.apache.org>
Subject Hadoop-Yarn-trunk - Build # 513 - Still Failing
Date Tue, 18 Mar 2014 11:07:39 GMT
See https://builds.apache.org/job/Hadoop-Yarn-trunk/513/

###################################################################################
########################## LAST 60 LINES OF THE CONSOLE ###########################
[...truncated 15152 lines...]

[INFO] ------------------------------------------------------------------------
[INFO] Reactor Summary:
[INFO] 
[INFO] hadoop-yarn ....................................... SUCCESS [2.817s]
[INFO] hadoop-yarn-api ................................... SUCCESS [3:16.780s]
[INFO] hadoop-yarn-common ................................ SUCCESS [2:20.140s]
[INFO] hadoop-yarn-server ................................ SUCCESS [0.080s]
[INFO] hadoop-yarn-server-common ......................... SUCCESS [33.805s]
[INFO] hadoop-yarn-server-nodemanager .................... SUCCESS [4:39.844s]
[INFO] hadoop-yarn-server-web-proxy ...................... SUCCESS [19.508s]
[INFO] hadoop-yarn-server-applicationhistoryservice ...... SUCCESS [1:19.425s]
[INFO] hadoop-yarn-server-resourcemanager ................ FAILURE [19:27.225s]
[INFO] hadoop-yarn-server-tests .......................... SKIPPED
[INFO] hadoop-yarn-client ................................ SKIPPED
[INFO] hadoop-yarn-applications .......................... SKIPPED
[INFO] hadoop-yarn-applications-distributedshell ......... SKIPPED
[INFO] hadoop-yarn-applications-unmanaged-am-launcher .... SKIPPED
[INFO] hadoop-yarn-site .................................. SKIPPED
[INFO] hadoop-yarn-project ............................... SKIPPED
[INFO] ------------------------------------------------------------------------
[INFO] BUILD FAILURE
[INFO] ------------------------------------------------------------------------
[INFO] Total time: 32:01.843s
[INFO] Finished at: Tue Mar 18 11:07:31 UTC 2014
[INFO] Final Memory: 49M/785M
[INFO] ------------------------------------------------------------------------
[ERROR] Failed to execute goal org.apache.maven.plugins:maven-surefire-plugin:2.16:test (default-test)
on project hadoop-yarn-server-resourcemanager: There are test failures.
[ERROR] 
[ERROR] Please refer to /home/jenkins/jenkins-slave/workspace/Hadoop-Yarn-trunk/trunk/hadoop-yarn-project/hadoop-yarn/hadoop-yarn-server/hadoop-yarn-server-resourcemanager/target/surefire-reports
for the individual test results.
[ERROR] -> [Help 1]
[ERROR] 
[ERROR] To see the full stack trace of the errors, re-run Maven with the -e switch.
[ERROR] Re-run Maven using the -X switch to enable full debug logging.
[ERROR] 
[ERROR] For more information about the errors and possible solutions, please read the following
articles:
[ERROR] [Help 1] http://cwiki.apache.org/confluence/display/MAVEN/MojoFailureException
[ERROR] 
[ERROR] After correcting the problems, you can resume the build with the command
[ERROR]   mvn <goals> -rf :hadoop-yarn-server-resourcemanager
Build step 'Execute shell' marked build as failure
Archiving artifacts
Updating YARN-1846
Updating YARN-1845
Updating HDFS-5516
Updating YARN-1839
Updating YARN-1136
Updating YARN-1685
Updating YARN-1591
Updating YARN-1512
Updating HDFS-6090
Updating HADOOP-10383
Updating HDFS-6094
Updating HDFS-6107
Updating YARN-1830
Updating YARN-1206
Sending e-mails to: yarn-dev@hadoop.apache.org
Email was triggered for: Failure
Sending email for trigger: Failure



###################################################################################
############################## FAILED TESTS (if any) ##############################
No tests ran.
Mime
  • Unnamed multipart/mixed (inline, None, 0 bytes)
View raw message