hadoop-yarn-dev mailing list archives

Site index · List index
Message view « Date » · « Thread »
Top « Date » · « Thread »
From Apache Jenkins Server <jenk...@builds.apache.org>
Subject Hadoop-Yarn-trunk - Build # 571 - Still Failing
Date Mon, 02 Jun 2014 12:08:04 GMT
See https://builds.apache.org/job/Hadoop-Yarn-trunk/571/

###################################################################################
########################## LAST 60 LINES OF THE CONSOLE ###########################
[...truncated 16152 lines...]
	at org.apache.hadoop.yarn.client.TestRMAdminCLI.testError(TestRMAdminCLI.java:366)
	at org.apache.hadoop.yarn.client.TestRMAdminCLI.testHelp(TestRMAdminCLI.java:307)


Results :

Failed tests: 
  TestRMAdminCLI.testHelp:307->testError:366 null

Tests in error: 
  TestRMAdminCLI.testTransitionToActive:180 ยป UnsupportedOperation

Tests run: 126, Failures: 1, Errors: 1, Skipped: 0

[INFO] ------------------------------------------------------------------------
[INFO] Reactor Summary:
[INFO] 
[INFO] hadoop-yarn ....................................... SUCCESS [3.179s]
[INFO] hadoop-yarn-api ................................... SUCCESS [3:07.642s]
[INFO] hadoop-yarn-common ................................ SUCCESS [2:13.942s]
[INFO] hadoop-yarn-server ................................ SUCCESS [0.069s]
[INFO] hadoop-yarn-server-common ......................... SUCCESS [35.896s]
[INFO] hadoop-yarn-server-nodemanager .................... SUCCESS [4:39.459s]
[INFO] hadoop-yarn-server-web-proxy ...................... SUCCESS [19.896s]
[INFO] hadoop-yarn-server-applicationhistoryservice ...... SUCCESS [1:17.663s]
[INFO] hadoop-yarn-server-resourcemanager ................ SUCCESS [20:32.198s]
[INFO] hadoop-yarn-server-tests .......................... SUCCESS [1:20.415s]
[INFO] hadoop-yarn-client ................................ FAILURE [8:26.232s]
[INFO] hadoop-yarn-applications .......................... SKIPPED
[INFO] hadoop-yarn-applications-distributedshell ......... SKIPPED
[INFO] hadoop-yarn-applications-unmanaged-am-launcher .... SKIPPED
[INFO] hadoop-yarn-site .................................. SKIPPED
[INFO] hadoop-yarn-project ............................... SKIPPED
[INFO] ------------------------------------------------------------------------
[INFO] BUILD FAILURE
[INFO] ------------------------------------------------------------------------
[INFO] Total time: 42:38.748s
[INFO] Finished at: Mon Jun 02 11:18:05 UTC 2014
[INFO] Final Memory: 54M/579M
[INFO] ------------------------------------------------------------------------
[ERROR] Failed to execute goal org.apache.maven.plugins:maven-surefire-plugin:2.16:test (default-test)
on project hadoop-yarn-client: There are test failures.
[ERROR] 
[ERROR] Please refer to /home/jenkins/jenkins-slave/workspace/Hadoop-Yarn-trunk/trunk/hadoop-yarn-project/hadoop-yarn/hadoop-yarn-client/target/surefire-reports
for the individual test results.
[ERROR] -> [Help 1]
[ERROR] 
[ERROR] To see the full stack trace of the errors, re-run Maven with the -e switch.
[ERROR] Re-run Maven using the -X switch to enable full debug logging.
[ERROR] 
[ERROR] For more information about the errors and possible solutions, please read the following
articles:
[ERROR] [Help 1] http://cwiki.apache.org/confluence/display/MAVEN/MojoFailureException
[ERROR] 
[ERROR] After correcting the problems, you can resume the build with the command
[ERROR]   mvn <goals> -rf :hadoop-yarn-client
Build step 'Execute shell' marked build as failure
Archiving artifacts
Updating YARN-2103
Sending e-mails to: yarn-dev@hadoop.apache.org
Email was triggered for: Failure
Sending email for trigger: Failure



###################################################################################
############################## FAILED TESTS (if any) ##############################
No tests ran.
Mime
  • Unnamed multipart/mixed (inline, None, 0 bytes)
View raw message