hadoop-yarn-dev mailing list archives

Site index · List index
Message view « Date » · « Thread »
Top « Date » · « Thread »
From Apache Jenkins Server <jenk...@builds.apache.org>
Subject Failed: YARN-1424 PreCommit Build #3932
Date Sat, 07 Jun 2014 01:28:15 GMT
Jira: https://issues.apache.org/jira/browse/YARN-1424
Build: https://builds.apache.org/job/PreCommit-YARN-Build/3932/

###################################################################################
########################## LAST 60 LINES OF THE CONSOLE ###########################
[...truncated 2990 lines...]
  http://issues.apache.org/jira/secure/attachment/12648773/YARN1424-02.patch
  against trunk revision .

    {color:green}+1 @author{color}.  The patch does not contain any @author tags.

    {color:green}+1 tests included{color}.  The patch appears to include 2 new or modified
test files.

    {color:green}+1 javac{color}.  The applied patch does not increase the total number of
javac compiler warnings.

    {color:green}+1 javadoc{color}.  There were no new javadoc warning messages.

    {color:green}+1 eclipse:eclipse{color}.  The patch built with eclipse:eclipse.

    {color:green}+1 findbugs{color}.  The patch does not introduce any new Findbugs (version
1.3.9) warnings.

    {color:green}+1 release audit{color}.  The applied patch does not increase the total number
of release audit warnings.

    {color:red}-1 core tests{color}.  The patch failed these unit tests in hadoop-yarn-project/hadoop-yarn/hadoop-yarn-server/hadoop-yarn-server-resourcemanager:

                  org.apache.hadoop.yarn.server.resourcemanager.TestApplicationACLs

    {color:green}+1 contrib tests{color}.  The patch passed contrib unit tests.

Test results: https://builds.apache.org/job/PreCommit-YARN-Build/3932//testReport/
Console output: https://builds.apache.org/job/PreCommit-YARN-Build/3932//console

This message is automatically generated.


======================================================================
======================================================================
    Adding comment to Jira.
======================================================================
======================================================================


Comment added.
31aaf83a45b81f4d2e0e3dbb8794b57eec8e1d80 logged out


======================================================================
======================================================================
    Finished build.
======================================================================
======================================================================


Build step 'Execute shell' marked build as failure
Archiving artifacts
Sending artifact delta relative to PreCommit-YARN-Build #3931
Archived 17 artifacts
Archive block size is 32768
Received 220 blocks and 836694 bytes
Compression is 89.6%
Took 0.76 sec
[description-setter] Could not determine description.
Recording test results
Email was triggered for: Failure
Sending email for trigger: Failure



###################################################################################
############################## FAILED TESTS (if any) ##############################
1 tests failed.
FAILED:  org.apache.hadoop.yarn.server.resourcemanager.TestApplicationACLs.testApplicationACLs

Error Message:
Enemy should not see app used resources expected:<-1> but was:<0>

Stack Trace:
java.lang.AssertionError: Enemy should not see app used resources expected:<-1> but
was:<0>
	at org.junit.Assert.fail(Assert.java:88)
	at org.junit.Assert.failNotEquals(Assert.java:743)
	at org.junit.Assert.assertEquals(Assert.java:118)
	at org.junit.Assert.assertEquals(Assert.java:555)
	at org.apache.hadoop.yarn.server.resourcemanager.TestApplicationACLs.verifyEnemyAppReport(TestApplicationACLs.java:384)
	at org.apache.hadoop.yarn.server.resourcemanager.TestApplicationACLs.verifyEnemyAccess(TestApplicationACLs.java:337)
	at org.apache.hadoop.yarn.server.resourcemanager.TestApplicationACLs.testApplicationACLs(TestApplicationACLs.java:177)



Mime
  • Unnamed multipart/mixed (inline, None, 0 bytes)
View raw message