hadoop-yarn-dev mailing list archives

Site index · List index
Message view « Date » · « Thread »
Top « Date » · « Thread »
From Apache Jenkins Server <jenk...@builds.apache.org>
Subject Build failed in Jenkins: Hadoop-Yarn-trunk #615
Date Thu, 17 Jul 2014 10:37:26 GMT
See <https://builds.apache.org/job/Hadoop-Yarn-trunk/615/changes>

Changes:

[cnauroth] HADOOP-10840. Fix OutOfMemoryError caused by metrics system in Azure File System.
Contributed by Shanyu Zhao.

[jianhe] YARN-2219. Addendum patch for YARN-2219

[wang] HADOOP-10816. KeyShell returns -1 on error to the shell, should be 1. (Mike Yoder via
wang)

[wang] HDFS-6690. Deduplicate xattr names in memory. (wang)

[vinodkv] YARN-2219. Changed ResourceManager to avoid AMs and NMs getting exceptions after
RM recovery but before scheduler learns about apps and app-attempts. Contributed by Jian He.

[aw] HDFS-2538. option to disable fsck dots. Contributed by Mohammad Kamrul Islam.

[wang] MAPREDUCE-5971. Move the default options for distcp -p to DistCpOptionSwitch. Contributed
by Charles Lamb.

[kasha] MAPREDUCE-5952. LocalContainerLauncher#renameMapOutputForReduce incorrectly assumes
a single dir for mapOutIndex. (Gera Shegalov via kasha)

[brandonli] HDFS-6689. NFS doesn't return correct lookup access for direcories. Contributed
by Brandon Li

[cnauroth] HADOOP-10839. Add unregisterSource() to MetricsSystem API. Contributed by Shanyu
Zhao.

[jianhe] YARN-2264. Fixed a race condition in DrainDispatcher which may cause random test
failures. Contributed by Li Lu

[cnauroth] HDFS-5624. Add HDFS tests for ACLs in combination with viewfs. Contributed by Stephen
Chu.

[umamahesh] HADOOP-10824. Refactor KMSACLs to avoid locking. (Benoy Antony via umamahesh)

[vinayakumarb] HADOOP-9921. daemon scripts should remove pid file on stop call after stop
or process is found not running ( Contributed by Vinayakumar B)

------------------------------------------
[...truncated 12522 lines...]
Building index for all the packages and classes...
Generating <https://builds.apache.org/job/Hadoop-Yarn-trunk/ws/trunk/hadoop-yarn-project/hadoop-yarn/hadoop-yarn-api/target/overview-tree.html...>
Generating <https://builds.apache.org/job/Hadoop-Yarn-trunk/ws/trunk/hadoop-yarn-project/hadoop-yarn/hadoop-yarn-api/target/index-all.html...>
Generating <https://builds.apache.org/job/Hadoop-Yarn-trunk/ws/trunk/hadoop-yarn-project/hadoop-yarn/hadoop-yarn-api/target/deprecated-list.html...>
Building index for all classes...
Generating <https://builds.apache.org/job/Hadoop-Yarn-trunk/ws/trunk/hadoop-yarn-project/hadoop-yarn/hadoop-yarn-api/target/allclasses-frame.html...>
Generating <https://builds.apache.org/job/Hadoop-Yarn-trunk/ws/trunk/hadoop-yarn-project/hadoop-yarn/hadoop-yarn-api/target/allclasses-noframe.html...>
Generating <https://builds.apache.org/job/Hadoop-Yarn-trunk/ws/trunk/hadoop-yarn-project/hadoop-yarn/hadoop-yarn-api/target/index.html...>
Generating <https://builds.apache.org/job/Hadoop-Yarn-trunk/ws/trunk/hadoop-yarn-project/hadoop-yarn/hadoop-yarn-api/target/overview-summary.html...>
Generating <https://builds.apache.org/job/Hadoop-Yarn-trunk/ws/trunk/hadoop-yarn-project/hadoop-yarn/hadoop-yarn-api/target/help-doc.html...>
Generating <https://builds.apache.org/job/Hadoop-Yarn-trunk/ws/trunk/hadoop-yarn-project/hadoop-yarn/hadoop-yarn-api/target/stylesheet.css...>
1 warning
[WARNING] Javadoc Warnings
[WARNING] <https://builds.apache.org/job/Hadoop-Yarn-trunk/ws/trunk/hadoop-yarn-project/hadoop-yarn/hadoop-yarn-api/src/main/java/org/apache/hadoop/yarn/conf/YarnConfiguration.java>:1011:
warning - Tag @link: reference not found: DEFAULT_YARN_CROSS_PLATFORM_APPLICATION_CLASSPATH
[INFO] Building jar: <https://builds.apache.org/job/Hadoop-Yarn-trunk/ws/trunk/hadoop-yarn-project/hadoop-yarn/hadoop-yarn-api/target/hadoop-yarn-api-3.0.0-SNAPSHOT-javadoc.jar>
[INFO] 
[INFO] --- maven-enforcer-plugin:1.3.1:enforce (depcheck) @ hadoop-yarn-api ---
[INFO] 
[INFO] --- maven-checkstyle-plugin:2.6:checkstyle (default-cli) @ hadoop-yarn-api ---
[INFO] 
[INFO] There are 3023 checkstyle errors.
[WARNING] Unable to locate Source XRef to link to - DISABLED
[INFO] 
[INFO] --- findbugs-maven-plugin:2.3.2:findbugs (default-cli) @ hadoop-yarn-api ---
[INFO] ****** FindBugsMojo execute *******
[INFO] canGenerate is true
[INFO] ****** FindBugsMojo executeFindbugs *******
[INFO] Temp File is <https://builds.apache.org/job/Hadoop-Yarn-trunk/ws/trunk/hadoop-yarn-project/hadoop-yarn/hadoop-yarn-api/target/findbugsTemp.xml>
[INFO] Fork Value is true
[INFO] xmlOutput is true
[INFO]                                                                         
[INFO] ------------------------------------------------------------------------
[INFO] Building hadoop-yarn-common 3.0.0-SNAPSHOT
[INFO] ------------------------------------------------------------------------
[WARNING] The POM for org.eclipse.m2e:lifecycle-mapping:jar:1.0.0 is missing, no dependency
information available
[WARNING] Failed to retrieve plugin descriptor for org.eclipse.m2e:lifecycle-mapping:1.0.0:
Plugin org.eclipse.m2e:lifecycle-mapping:1.0.0 or one of its dependencies could not be resolved:
Failure to find org.eclipse.m2e:lifecycle-mapping:jar:1.0.0 in http://repo.maven.apache.org/maven2
was cached in the local repository, resolution will not be reattempted until the update interval
of central has elapsed or updates are forced
[INFO] 
[INFO] --- maven-clean-plugin:2.4.1:clean (default-clean) @ hadoop-yarn-common ---
[INFO] Deleting <https://builds.apache.org/job/Hadoop-Yarn-trunk/ws/trunk/hadoop-yarn-project/hadoop-yarn/hadoop-yarn-common/target>
[INFO] 
[INFO] --- maven-antrun-plugin:1.7:run (create-testdirs) @ hadoop-yarn-common ---
[INFO] Executing tasks

main:
    [mkdir] Created dir: <https://builds.apache.org/job/Hadoop-Yarn-trunk/ws/trunk/hadoop-yarn-project/hadoop-yarn/hadoop-yarn-common/target/test-dir>
[INFO] Executed tasks
[INFO] 
[INFO] --- hadoop-maven-plugins:3.0.0-SNAPSHOT:version-info (version-info) @ hadoop-yarn-common
---
[WARNING] [svn, info] failed with error code 1
[WARNING] [git, branch] failed with error code 128
[INFO] SCM: NONE
[INFO] Computed MD5: 6eb24fb0d3d5f9ee7526c12830efb8
[INFO] 
[INFO] --- maven-resources-plugin:2.2:resources (default-resources) @ hadoop-yarn-common ---
[INFO] Using default encoding to copy filtered resources.
[INFO] 
[INFO] --- maven-compiler-plugin:2.5.1:compile (default-compile) @ hadoop-yarn-common ---
[INFO] Compiling 266 source files to <https://builds.apache.org/job/Hadoop-Yarn-trunk/ws/trunk/hadoop-yarn-project/hadoop-yarn/hadoop-yarn-common/target/classes>
[INFO] 
[INFO] --- maven-resources-plugin:2.2:testResources (default-testResources) @ hadoop-yarn-common
---
[INFO] Using default encoding to copy filtered resources.
[INFO] 
[INFO] --- maven-compiler-plugin:2.5.1:testCompile (default-testCompile) @ hadoop-yarn-common
---
[INFO] Compiling 61 source files to <https://builds.apache.org/job/Hadoop-Yarn-trunk/ws/trunk/hadoop-yarn-project/hadoop-yarn/hadoop-yarn-common/target/test-classes>
[INFO] 
[INFO] --- maven-jar-plugin:2.3.1:test-jar (default) @ hadoop-yarn-common ---
[INFO] Building jar: <https://builds.apache.org/job/Hadoop-Yarn-trunk/ws/trunk/hadoop-yarn-project/hadoop-yarn/hadoop-yarn-common/target/hadoop-yarn-common-3.0.0-SNAPSHOT-tests.jar>
[INFO] 
[INFO] --- maven-surefire-plugin:2.16:test (default-test) @ hadoop-yarn-common ---
[INFO] Surefire report directory: <https://builds.apache.org/job/Hadoop-Yarn-trunk/ws/trunk/hadoop-yarn-project/hadoop-yarn/hadoop-yarn-common/target/surefire-reports>

-------------------------------------------------------
 T E S T S
-------------------------------------------------------

-------------------------------------------------------
 T E S T S
-------------------------------------------------------
Running org.apache.hadoop.yarn.webapp.view.TestHtmlBlock
Tests run: 3, Failures: 0, Errors: 0, Skipped: 0, Time elapsed: 0.737 sec - in org.apache.hadoop.yarn.webapp.view.TestHtmlBlock
Running org.apache.hadoop.yarn.webapp.view.TestTwoColumnLayout
Tests run: 1, Failures: 0, Errors: 0, Skipped: 0, Time elapsed: 1.101 sec - in org.apache.hadoop.yarn.webapp.view.TestTwoColumnLayout
Running org.apache.hadoop.yarn.webapp.view.TestInfoBlock
Tests run: 2, Failures: 0, Errors: 0, Skipped: 0, Time elapsed: 0.716 sec - in org.apache.hadoop.yarn.webapp.view.TestInfoBlock
Running org.apache.hadoop.yarn.webapp.view.TestTwoColumnCssPage
Tests run: 1, Failures: 0, Errors: 0, Skipped: 0, Time elapsed: 1.109 sec - in org.apache.hadoop.yarn.webapp.view.TestTwoColumnCssPage
Running org.apache.hadoop.yarn.webapp.view.TestHtmlPage
Tests run: 2, Failures: 0, Errors: 0, Skipped: 0, Time elapsed: 0.756 sec - in org.apache.hadoop.yarn.webapp.view.TestHtmlPage
Running org.apache.hadoop.yarn.webapp.view.TestCommonViews
Tests run: 5, Failures: 0, Errors: 0, Skipped: 0, Time elapsed: 0.89 sec - in org.apache.hadoop.yarn.webapp.view.TestCommonViews
Running org.apache.hadoop.yarn.webapp.TestParseRoute
Tests run: 10, Failures: 0, Errors: 0, Skipped: 0, Time elapsed: 0.169 sec - in org.apache.hadoop.yarn.webapp.TestParseRoute
Running org.apache.hadoop.yarn.webapp.test.TestWebAppTests
Tests run: 4, Failures: 0, Errors: 0, Skipped: 0, Time elapsed: 0.566 sec - in org.apache.hadoop.yarn.webapp.test.TestWebAppTests
Running org.apache.hadoop.yarn.webapp.TestWebApp
Tests run: 9, Failures: 0, Errors: 0, Skipped: 0, Time elapsed: 3.728 sec - in org.apache.hadoop.yarn.webapp.TestWebApp
Running org.apache.hadoop.yarn.webapp.TestSubViews
Tests run: 1, Failures: 0, Errors: 0, Skipped: 0, Time elapsed: 0.766 sec - in org.apache.hadoop.yarn.webapp.TestSubViews
Running org.apache.hadoop.yarn.webapp.hamlet.TestHamlet
Tests run: 6, Failures: 0, Errors: 0, Skipped: 0, Time elapsed: 0.539 sec - in org.apache.hadoop.yarn.webapp.hamlet.TestHamlet
Running org.apache.hadoop.yarn.webapp.hamlet.TestParseSelector
Tests run: 5, Failures: 0, Errors: 0, Skipped: 0, Time elapsed: 0.103 sec - in org.apache.hadoop.yarn.webapp.hamlet.TestParseSelector
Running org.apache.hadoop.yarn.webapp.hamlet.TestHamletImpl
Tests run: 4, Failures: 0, Errors: 0, Skipped: 0, Time elapsed: 0.487 sec - in org.apache.hadoop.yarn.webapp.hamlet.TestHamletImpl
Running org.apache.hadoop.yarn.TestContainerLaunchRPC
Tests run: 1, Failures: 0, Errors: 0, Skipped: 0, Time elapsed: 4.136 sec - in org.apache.hadoop.yarn.TestContainerLaunchRPC
Running org.apache.hadoop.yarn.conf.TestHAUtil
Tests run: 4, Failures: 0, Errors: 0, Skipped: 0, Time elapsed: 0.557 sec - in org.apache.hadoop.yarn.conf.TestHAUtil
Running org.apache.hadoop.yarn.conf.TestYarnConfiguration
Tests run: 3, Failures: 0, Errors: 0, Skipped: 0, Time elapsed: 0.51 sec - in org.apache.hadoop.yarn.conf.TestYarnConfiguration
Running org.apache.hadoop.yarn.TestRPCFactories
Tests run: 1, Failures: 0, Errors: 0, Skipped: 0, Time elapsed: 0.863 sec - in org.apache.hadoop.yarn.TestRPCFactories
Running org.apache.hadoop.yarn.util.TestApplicationClassLoader
Tests run: 3, Failures: 0, Errors: 0, Skipped: 0, Time elapsed: 0.189 sec - in org.apache.hadoop.yarn.util.TestApplicationClassLoader
Running org.apache.hadoop.yarn.util.TestLinuxResourceCalculatorPlugin
Tests run: 2, Failures: 0, Errors: 0, Skipped: 0, Time elapsed: 0.164 sec - in org.apache.hadoop.yarn.util.TestLinuxResourceCalculatorPlugin
Running org.apache.hadoop.yarn.util.TestProcfsBasedProcessTree
Tests run: 5, Failures: 0, Errors: 0, Skipped: 0, Time elapsed: 0.873 sec - in org.apache.hadoop.yarn.util.TestProcfsBasedProcessTree
Running org.apache.hadoop.yarn.util.TestYarnVersionInfo
Tests run: 1, Failures: 0, Errors: 0, Skipped: 0, Time elapsed: 0.142 sec - in org.apache.hadoop.yarn.util.TestYarnVersionInfo
Running org.apache.hadoop.yarn.util.TestConverterUtils
Tests run: 4, Failures: 0, Errors: 0, Skipped: 0, Time elapsed: 0.346 sec - in org.apache.hadoop.yarn.util.TestConverterUtils
Running org.apache.hadoop.yarn.util.TestWindowsResourceCalculatorPlugin
Tests run: 3, Failures: 0, Errors: 0, Skipped: 0, Time elapsed: 1.648 sec - in org.apache.hadoop.yarn.util.TestWindowsResourceCalculatorPlugin
Running org.apache.hadoop.yarn.util.TestResourceCalculatorProcessTree
Tests run: 2, Failures: 0, Errors: 0, Skipped: 0, Time elapsed: 0.16 sec - in org.apache.hadoop.yarn.util.TestResourceCalculatorProcessTree
Running org.apache.hadoop.yarn.util.TestTimes
Tests run: 5, Failures: 0, Errors: 0, Skipped: 0, Time elapsed: 0.146 sec - in org.apache.hadoop.yarn.util.TestTimes
Running org.apache.hadoop.yarn.util.TestRackResolverScriptBasedMapping
Tests run: 1, Failures: 0, Errors: 0, Skipped: 0, Time elapsed: 0.278 sec - in org.apache.hadoop.yarn.util.TestRackResolverScriptBasedMapping
Running org.apache.hadoop.yarn.util.TestRackResolver
Tests run: 1, Failures: 0, Errors: 0, Skipped: 0, Time elapsed: 0.973 sec - in org.apache.hadoop.yarn.util.TestRackResolver
Running org.apache.hadoop.yarn.util.TestWindowsBasedProcessTree
Tests run: 1, Failures: 0, Errors: 0, Skipped: 0, Time elapsed: 0.155 sec - in org.apache.hadoop.yarn.util.TestWindowsBasedProcessTree
Running org.apache.hadoop.yarn.util.TestFSDownload
Tests run: 9, Failures: 1, Errors: 0, Skipped: 0, Time elapsed: 2.001 sec <<< FAILURE!
- in org.apache.hadoop.yarn.util.TestFSDownload
testDownloadPublicWithStatCache(org.apache.hadoop.yarn.util.TestFSDownload)  Time elapsed:
0.138 sec  <<< FAILURE!
java.lang.AssertionError: null
	at org.junit.Assert.fail(Assert.java:86)
	at org.junit.Assert.assertTrue(Assert.java:41)
	at org.junit.Assert.assertTrue(Assert.java:52)
	at org.apache.hadoop.yarn.util.TestFSDownload.testDownloadPublicWithStatCache(TestFSDownload.java:363)

Running org.apache.hadoop.yarn.TestRecordFactory
Tests run: 1, Failures: 0, Errors: 0, Skipped: 0, Time elapsed: 0.216 sec - in org.apache.hadoop.yarn.TestRecordFactory
Running org.apache.hadoop.yarn.api.TestNodeId
Tests run: 1, Failures: 0, Errors: 0, Skipped: 0, Time elapsed: 0.294 sec - in org.apache.hadoop.yarn.api.TestNodeId
Running org.apache.hadoop.yarn.api.TestContainerResourceDecrease
Tests run: 2, Failures: 0, Errors: 0, Skipped: 0, Time elapsed: 0.312 sec - in org.apache.hadoop.yarn.api.TestContainerResourceDecrease
Running org.apache.hadoop.yarn.api.records.impl.pb.TestSerializedExceptionPBImpl
Tests run: 3, Failures: 0, Errors: 0, Skipped: 0, Time elapsed: 0.09 sec - in org.apache.hadoop.yarn.api.records.impl.pb.TestSerializedExceptionPBImpl
Running org.apache.hadoop.yarn.api.records.timeline.TestTimelineRecords
Tests run: 3, Failures: 0, Errors: 0, Skipped: 0, Time elapsed: 0.472 sec - in org.apache.hadoop.yarn.api.records.timeline.TestTimelineRecords
Running org.apache.hadoop.yarn.api.TestApplicatonReport
Tests run: 1, Failures: 0, Errors: 0, Skipped: 0, Time elapsed: 0.328 sec - in org.apache.hadoop.yarn.api.TestApplicatonReport
Running org.apache.hadoop.yarn.api.TestContainerId
Tests run: 1, Failures: 0, Errors: 0, Skipped: 0, Time elapsed: 0.307 sec - in org.apache.hadoop.yarn.api.TestContainerId
Running org.apache.hadoop.yarn.api.TestAllocateResponse
Tests run: 2, Failures: 0, Errors: 0, Skipped: 0, Time elapsed: 0.348 sec - in org.apache.hadoop.yarn.api.TestAllocateResponse
Running org.apache.hadoop.yarn.api.TestContainerResourceIncrease
Tests run: 2, Failures: 0, Errors: 0, Skipped: 0, Time elapsed: 0.322 sec - in org.apache.hadoop.yarn.api.TestContainerResourceIncrease
Running org.apache.hadoop.yarn.api.TestGetApplicationsRequest
Tests run: 1, Failures: 0, Errors: 0, Skipped: 0, Time elapsed: 0.322 sec - in org.apache.hadoop.yarn.api.TestGetApplicationsRequest
Running org.apache.hadoop.yarn.api.TestAllocateRequest
Tests run: 2, Failures: 0, Errors: 0, Skipped: 0, Time elapsed: 0.317 sec - in org.apache.hadoop.yarn.api.TestAllocateRequest
Running org.apache.hadoop.yarn.api.TestContainerResourceIncreaseRequest
Tests run: 2, Failures: 0, Errors: 0, Skipped: 0, Time elapsed: 0.315 sec - in org.apache.hadoop.yarn.api.TestContainerResourceIncreaseRequest
Running org.apache.hadoop.yarn.api.TestApplicationAttemptId
Tests run: 1, Failures: 0, Errors: 0, Skipped: 0, Time elapsed: 0.303 sec - in org.apache.hadoop.yarn.api.TestApplicationAttemptId
Running org.apache.hadoop.yarn.api.TestApplicationId
Tests run: 1, Failures: 0, Errors: 0, Skipped: 0, Time elapsed: 0.298 sec - in org.apache.hadoop.yarn.api.TestApplicationId
Running org.apache.hadoop.yarn.logaggregation.TestAggregatedLogFormat
Tests run: 3, Failures: 0, Errors: 0, Skipped: 1, Time elapsed: 1.046 sec - in org.apache.hadoop.yarn.logaggregation.TestAggregatedLogFormat
Running org.apache.hadoop.yarn.logaggregation.TestAggregatedLogsBlock
Tests run: 4, Failures: 0, Errors: 0, Skipped: 0, Time elapsed: 1.065 sec - in org.apache.hadoop.yarn.logaggregation.TestAggregatedLogsBlock
Running org.apache.hadoop.yarn.logaggregation.TestAggregatedLogDeletionService
Tests run: 3, Failures: 0, Errors: 0, Skipped: 0, Time elapsed: 2.817 sec - in org.apache.hadoop.yarn.logaggregation.TestAggregatedLogDeletionService
Running org.apache.hadoop.yarn.ipc.TestRPCUtil
Tests run: 11, Failures: 0, Errors: 0, Skipped: 0, Time elapsed: 0.076 sec - in org.apache.hadoop.yarn.ipc.TestRPCUtil
Running org.apache.hadoop.yarn.TestRPC
Tests run: 2, Failures: 0, Errors: 0, Skipped: 0, Time elapsed: 1.118 sec - in org.apache.hadoop.yarn.TestRPC
Running org.apache.hadoop.yarn.TestYarnUncaughtExceptionHandler
Tests run: 3, Failures: 0, Errors: 0, Skipped: 0, Time elapsed: 0.339 sec - in org.apache.hadoop.yarn.TestYarnUncaughtExceptionHandler
Running org.apache.hadoop.yarn.client.TestClientRMProxy
Tests run: 1, Failures: 0, Errors: 0, Skipped: 0, Time elapsed: 0.424 sec - in org.apache.hadoop.yarn.client.TestClientRMProxy
Running org.apache.hadoop.yarn.TestRpcFactoryProvider
Tests run: 1, Failures: 0, Errors: 0, Skipped: 0, Time elapsed: 0.316 sec - in org.apache.hadoop.yarn.TestRpcFactoryProvider

Results :

Failed tests: 
  TestFSDownload.testDownloadPublicWithStatCache:363 null

Tests run: 150, Failures: 1, Errors: 0, Skipped: 1

[INFO] ------------------------------------------------------------------------
[INFO] Reactor Summary:
[INFO] 
[INFO] hadoop-yarn ....................................... SUCCESS [  2.956 s]
[INFO] hadoop-yarn-api ................................... SUCCESS [02:13 min]
[INFO] hadoop-yarn-common ................................ FAILURE [ 54.378 s]
[INFO] hadoop-yarn-server ................................ SKIPPED
[INFO] hadoop-yarn-server-common ......................... SKIPPED
[INFO] hadoop-yarn-server-nodemanager .................... SKIPPED
[INFO] hadoop-yarn-server-web-proxy ...................... SKIPPED
[INFO] hadoop-yarn-server-applicationhistoryservice ...... SKIPPED
[INFO] hadoop-yarn-server-resourcemanager ................ SKIPPED
[INFO] hadoop-yarn-server-tests .......................... SKIPPED
[INFO] hadoop-yarn-client ................................ SKIPPED
[INFO] hadoop-yarn-applications .......................... SKIPPED
[INFO] hadoop-yarn-applications-distributedshell ......... SKIPPED
[INFO] hadoop-yarn-applications-unmanaged-am-launcher .... SKIPPED
[INFO] hadoop-yarn-site .................................. SKIPPED
[INFO] hadoop-yarn-project ............................... SKIPPED
[INFO] ------------------------------------------------------------------------
[INFO] BUILD FAILURE
[INFO] ------------------------------------------------------------------------
[INFO] Total time: 03:12 min
[INFO] Finished at: 2014-07-17T10:35:54+00:00
[INFO] Final Memory: 78M/1044M
[INFO] ------------------------------------------------------------------------
[ERROR] Failed to execute goal org.apache.maven.plugins:maven-surefire-plugin:2.16:test (default-test)
on project hadoop-yarn-common: There are test failures.
[ERROR] 
[ERROR] Please refer to <https://builds.apache.org/job/Hadoop-Yarn-trunk/ws/trunk/hadoop-yarn-project/hadoop-yarn/hadoop-yarn-common/target/surefire-reports>
for the individual test results.
[ERROR] -> [Help 1]
[ERROR] 
[ERROR] To see the full stack trace of the errors, re-run Maven with the -e switch.
[ERROR] Re-run Maven using the -X switch to enable full debug logging.
[ERROR] 
[ERROR] For more information about the errors and possible solutions, please read the following
articles:
[ERROR] [Help 1] http://cwiki.apache.org/confluence/display/MAVEN/MojoFailureException
[ERROR] 
[ERROR] After correcting the problems, you can resume the build with the command
[ERROR]   mvn <goals> -rf :hadoop-yarn-common
Build step 'Execute shell' marked build as failure
Archiving artifacts
Updating HADOOP-10824
Updating HDFS-6689
Updating HDFS-5624
Updating HADOOP-10816
Updating HADOOP-10840
Updating MAPREDUCE-5952
Updating MAPREDUCE-5971
Updating YARN-2219
Updating HADOOP-10839
Updating HADOOP-9921
Updating YARN-2264
Updating HDFS-2538
Updating HDFS-6690

Mime
View raw message