hadoop-yarn-dev mailing list archives

Site index · List index
Message view « Date » · « Thread »
Top « Date » · « Thread »
From Apache Jenkins Server <jenk...@builds.apache.org>
Subject Failed: YARN-2211 PreCommit Build #4430
Date Fri, 25 Jul 2014 18:25:29 GMT
Jira: https://issues.apache.org/jira/browse/YARN-2211
Build: https://builds.apache.org/job/PreCommit-YARN-Build/4430/

###################################################################################
########################## LAST 60 LINES OF THE CONSOLE ###########################
[...truncated 3198 lines...]
  http://issues.apache.org/jira/secure/attachment/12657856/YARN-2211.8.patch
  against trunk revision .

    {color:green}+1 @author{color}.  The patch does not contain any @author tags.

    {color:green}+1 tests included{color}.  The patch appears to include 9 new or modified
test files.

    {color:green}+1 javac{color}.  The applied patch does not increase the total number of
javac compiler warnings.

    {color:green}+1 javadoc{color}.  There were no new javadoc warning messages.

    {color:green}+1 eclipse:eclipse{color}.  The patch built with eclipse:eclipse.

    {color:green}+1 findbugs{color}.  The patch does not introduce any new Findbugs (version
2.0.3) warnings.

    {color:green}+1 release audit{color}.  The applied patch does not increase the total number
of release audit warnings.

    {color:red}-1 core tests{color}.  The patch failed these unit tests in hadoop-yarn-project/hadoop-yarn/hadoop-yarn-client
hadoop-yarn-project/hadoop-yarn/hadoop-yarn-server/hadoop-yarn-server-resourcemanager:

                  org.apache.hadoop.yarn.server.resourcemanager.security.TestAMRMTokens

    {color:green}+1 contrib tests{color}.  The patch passed contrib unit tests.

Test results: https://builds.apache.org/job/PreCommit-YARN-Build/4430//testReport/
Console output: https://builds.apache.org/job/PreCommit-YARN-Build/4430//console

This message is automatically generated.


======================================================================
======================================================================
    Adding comment to Jira.
======================================================================
======================================================================


Comment added.
41a7c281a6468d42b58c594b1e50f98df9adf972 logged out


======================================================================
======================================================================
    Finished build.
======================================================================
======================================================================


Build step 'Execute shell' marked build as failure
Archiving artifacts
Sending artifact delta relative to PreCommit-YARN-Build #4427
Archived 22 artifacts
Archive block size is 32768
Received 215 blocks and 1394462 bytes
Compression is 83.5%
Took 2.3 sec
[description-setter] Could not determine description.
Recording test results
Email was triggered for: Failure
Sending email for trigger: Failure



###################################################################################
############################## FAILED TESTS (if any) ##############################
2 tests failed.
FAILED:  org.apache.hadoop.yarn.server.resourcemanager.security.TestAMRMTokens.testTokenExpiry[0]

Error Message:
null

Stack Trace:
java.lang.AssertionError: null
	at org.junit.Assert.fail(Assert.java:86)
	at org.junit.Assert.assertTrue(Assert.java:41)
	at org.junit.Assert.assertTrue(Assert.java:52)
	at org.apache.hadoop.yarn.server.resourcemanager.security.TestAMRMTokens.testTokenExpiry(TestAMRMTokens.java:186)


FAILED:  org.apache.hadoop.yarn.server.resourcemanager.security.TestAMRMTokens.testTokenExpiry[1]

Error Message:
null

Stack Trace:
java.lang.AssertionError: null
	at org.junit.Assert.fail(Assert.java:86)
	at org.junit.Assert.assertTrue(Assert.java:41)
	at org.junit.Assert.assertTrue(Assert.java:52)
	at org.apache.hadoop.yarn.server.resourcemanager.security.TestAMRMTokens.testTokenExpiry(TestAMRMTokens.java:186)



Mime
  • Unnamed multipart/mixed (inline, None, 0 bytes)
View raw message