hadoop-yarn-dev mailing list archives

Site index · List index
Message view « Date » · « Thread »
Top « Date » · « Thread »
From Apache Jenkins Server <jenk...@builds.apache.org>
Subject Hadoop-Yarn-trunk - Build # 638 - Still Failing
Date Fri, 08 Aug 2014 12:01:50 GMT
See https://builds.apache.org/job/Hadoop-Yarn-trunk/638/

###################################################################################
########################## LAST 60 LINES OF THE CONSOLE ###########################
[...truncated 16679 lines...]
Results :

Tests run: 120, Failures: 0, Errors: 0, Skipped: 0

[INFO] ------------------------------------------------------------------------
[INFO] Reactor Summary:
[INFO] 
[INFO] hadoop-yarn ....................................... SUCCESS [  3.650 s]
[INFO] hadoop-yarn-api ................................... SUCCESS [02:38 min]
[INFO] hadoop-yarn-common ................................ SUCCESS [02:28 min]
[INFO] hadoop-yarn-server ................................ SUCCESS [  0.142 s]
[INFO] hadoop-yarn-server-common ......................... SUCCESS [ 42.380 s]
[INFO] hadoop-yarn-server-nodemanager .................... SUCCESS [05:19 min]
[INFO] hadoop-yarn-server-web-proxy ...................... SUCCESS [ 20.624 s]
[INFO] hadoop-yarn-server-applicationhistoryservice ...... SUCCESS [01:28 min]
[INFO] hadoop-yarn-server-resourcemanager ................ SUCCESS [28:58 min]
[INFO] hadoop-yarn-server-tests .......................... SUCCESS [01:21 min]
[INFO] hadoop-yarn-client ................................ FAILURE [08:39 min]
[INFO] hadoop-yarn-applications .......................... SKIPPED
[INFO] hadoop-yarn-applications-distributedshell ......... SKIPPED
[INFO] hadoop-yarn-applications-unmanaged-am-launcher .... SKIPPED
[INFO] hadoop-yarn-site .................................. SKIPPED
[INFO] hadoop-yarn-project ............................... SKIPPED
[INFO] ------------------------------------------------------------------------
[INFO] BUILD FAILURE
[INFO] ------------------------------------------------------------------------
[INFO] Total time: 52:01 min
[INFO] Finished at: 2014-08-08T11:58:27+00:00
[INFO] Final Memory: 86M/845M
[INFO] ------------------------------------------------------------------------
[ERROR] Failed to execute goal org.apache.maven.plugins:maven-surefire-plugin:2.16:test (default-test)
on project hadoop-yarn-client: ExecutionException; nested exception is java.util.concurrent.ExecutionException:
java.lang.RuntimeException: The forked VM terminated without saying properly goodbye. VM crash
or System.exit called ?
[ERROR] Command was/bin/sh -c cd /home/jenkins/jenkins-slave/workspace/Hadoop-Yarn-trunk/trunk/hadoop-yarn-project/hadoop-yarn/hadoop-yarn-client
&& /home/jenkins/tools/java/jdk1.6.0_45-64/jre/bin/java -Xmx1024m -XX:+HeapDumpOnOutOfMemoryError
-jar /home/jenkins/jenkins-slave/workspace/Hadoop-Yarn-trunk/trunk/hadoop-yarn-project/hadoop-yarn/hadoop-yarn-client/target/surefire/surefirebooter4720834089338269667.jar
/home/jenkins/jenkins-slave/workspace/Hadoop-Yarn-trunk/trunk/hadoop-yarn-project/hadoop-yarn/hadoop-yarn-client/target/surefire/surefire2749262424637832005tmp
/home/jenkins/jenkins-slave/workspace/Hadoop-Yarn-trunk/trunk/hadoop-yarn-project/hadoop-yarn/hadoop-yarn-client/target/surefire/surefire_2186603949789300842455tmp
[ERROR] -> [Help 1]
[ERROR] 
[ERROR] To see the full stack trace of the errors, re-run Maven with the -e switch.
[ERROR] Re-run Maven using the -X switch to enable full debug logging.
[ERROR] 
[ERROR] For more information about the errors and possible solutions, please read the following
articles:
[ERROR] [Help 1] http://cwiki.apache.org/confluence/display/MAVEN/MojoFailureException
[ERROR] 
[ERROR] After correcting the problems, you can resume the build with the command
[ERROR]   mvn <goals> -rf :hadoop-yarn-client
Build step 'Execute shell' marked build as failure
Archiving artifacts
Updating HDFS-6728
Updating HDFS-6772
Updating YARN-2008
Updating HADOOP-10771
Updating HADOOP-10929
Updating HDFS-6740
Updating HADOOP-10876
Updating MAPREDUCE-6021
Updating YARN-2288
Updating HADOOP-10931
Updating HDFS-6781
Updating HDFS-6722
Sending e-mails to: yarn-dev@hadoop.apache.org
Email was triggered for: Failure
Sending email for trigger: Failure



###################################################################################
############################## FAILED TESTS (if any) ##############################
No tests ran.
Mime
  • Unnamed multipart/mixed (inline, None, 0 bytes)
View raw message