hadoop-yarn-dev mailing list archives

Site index · List index
Message view « Date » · « Thread »
Top « Date » · « Thread »
From Apache Jenkins Server <jenk...@builds.apache.org>
Subject Failed: YARN-2352 PreCommit Build #4558
Date Fri, 08 Aug 2014 06:33:47 GMT
Jira: https://issues.apache.org/jira/browse/YARN-2352
Build: https://builds.apache.org/job/PreCommit-YARN-Build/4558/

###################################################################################
########################## LAST 60 LINES OF THE CONSOLE ###########################
[...truncated 4191 lines...]
  against trunk revision .

    {color:green}+1 @author{color}.  The patch does not contain any @author tags.

    {color:green}+1 tests included{color}.  The patch appears to include 1 new or modified
test files.

    {color:green}+1 javac{color}.  The applied patch does not increase the total number of
javac compiler warnings.

    {color:green}+1 javadoc{color}.  There were no new javadoc warning messages.

    {color:green}+1 eclipse:eclipse{color}.  The patch built with eclipse:eclipse.

    {color:green}+1 findbugs{color}.  The patch does not introduce any new Findbugs (version
2.0.3) warnings.

    {color:green}+1 release audit{color}.  The applied patch does not increase the total number
of release audit warnings.

    {color:red}-1 core tests{color}.  The patch failed these unit tests in hadoop-common-project/hadoop-common
hadoop-yarn-project/hadoop-yarn/hadoop-yarn-server/hadoop-yarn-server-resourcemanager:

                  org.apache.hadoop.metrics2.impl.TestMetricsSystemImpl
                  org.apache.hadoop.ha.TestZKFailoverControllerStress

    {color:green}+1 contrib tests{color}.  The patch passed contrib unit tests.

Test results: https://builds.apache.org/job/PreCommit-YARN-Build/4558//testReport/
Console output: https://builds.apache.org/job/PreCommit-YARN-Build/4558//console

This message is automatically generated.


======================================================================
======================================================================
    Adding comment to Jira.
======================================================================
======================================================================


Comment added.
63bb30fef7075b01324cd926a121f7814a8e0c00 logged out


======================================================================
======================================================================
    Finished build.
======================================================================
======================================================================


Build step 'Execute shell' marked build as failure
Archiving artifacts
Sending artifact delta relative to PreCommit-YARN-Build #4553
Archived 22 artifacts
Archive block size is 32768
Received 47 blocks and 7595842 bytes
Compression is 16.9%
Took 5.9 sec
[description-setter] Could not determine description.
Recording test results
Email was triggered for: Failure
Sending email for trigger: Failure



###################################################################################
############################## FAILED TESTS (if any) ##############################
2 tests failed.
REGRESSION:  org.apache.hadoop.ha.TestZKFailoverControllerStress.testExpireBackAndForth

Error Message:
KeeperErrorCode = NoNode

Stack Trace:
org.apache.zookeeper.KeeperException$NoNodeException: KeeperErrorCode = NoNode
	at org.apache.zookeeper.server.DataTree.getData(DataTree.java:648)
	at org.apache.zookeeper.server.ZKDatabase.getData(ZKDatabase.java:371)
	at org.apache.hadoop.ha.MiniZKFCCluster.expireActiveLockHolder(MiniZKFCCluster.java:199)
	at org.apache.hadoop.ha.MiniZKFCCluster.expireAndVerifyFailover(MiniZKFCCluster.java:234)
	at org.apache.hadoop.ha.TestZKFailoverControllerStress.testExpireBackAndForth(TestZKFailoverControllerStress.java:79)


REGRESSION:  org.apache.hadoop.metrics2.impl.TestMetricsSystemImpl.testMultiThreadedPublish

Error Message:
Metric not collected!
Metric not collected!
Metric not collected!
Metric not collected!
Metric not collected!
Metric not collected!
Metric not collected!
Metric not collected!
Metric not collected!
Passed

Stack Trace:
java.lang.AssertionError: Metric not collected!
Metric not collected!
Metric not collected!
Metric not collected!
Metric not collected!
Metric not collected!
Metric not collected!
Metric not collected!
Metric not collected!
Passed
	at org.junit.Assert.fail(Assert.java:88)
	at org.junit.Assert.assertTrue(Assert.java:41)
	at org.apache.hadoop.metrics2.impl.TestMetricsSystemImpl.testMultiThreadedPublish(TestMetricsSystemImpl.java:235)



Mime
  • Unnamed multipart/mixed (inline, None, 0 bytes)
View raw message