hadoop-yarn-dev mailing list archives

Site index · List index
Message view « Date » · « Thread »
Top « Date » · « Thread »
From Apache Jenkins Server <jenk...@builds.apache.org>
Subject Failed: YARN-2288 PreCommit Build #4547
Date Thu, 07 Aug 2014 06:21:16 GMT
Jira: https://issues.apache.org/jira/browse/YARN-2288
Build: https://builds.apache.org/job/PreCommit-YARN-Build/4547/

###################################################################################
########################## LAST 60 LINES OF THE CONSOLE ###########################
[...truncated 2892 lines...]
  http://issues.apache.org/jira/secure/attachment/12660309/YARN-2288-v4.patch
  against trunk revision .

    {color:green}+1 @author{color}.  The patch does not contain any @author tags.

    {color:green}+1 tests included{color}.  The patch appears to include 1 new or modified
test files.

    {color:green}+1 javac{color}.  The applied patch does not increase the total number of
javac compiler warnings.

    {color:green}+1 javadoc{color}.  There were no new javadoc warning messages.

    {color:green}+1 eclipse:eclipse{color}.  The patch built with eclipse:eclipse.

    {color:green}+1 findbugs{color}.  The patch does not introduce any new Findbugs (version
2.0.3) warnings.

    {color:green}+1 release audit{color}.  The applied patch does not increase the total number
of release audit warnings.

    {color:red}-1 core tests{color}.  The patch failed these unit tests in hadoop-yarn-project/hadoop-yarn/hadoop-yarn-server/hadoop-yarn-server-applicationhistoryservice:

                  org.apache.hadoop.yarn.server.timeline.TestLeveldbTimelineStore

    {color:green}+1 contrib tests{color}.  The patch passed contrib unit tests.

Test results: https://builds.apache.org/job/PreCommit-YARN-Build/4547//testReport/
Console output: https://builds.apache.org/job/PreCommit-YARN-Build/4547//console

This message is automatically generated.


======================================================================
======================================================================
    Adding comment to Jira.
======================================================================
======================================================================


Comment added.
f751b60675e2df2c0308f39f7f56188aaca24cdb logged out


======================================================================
======================================================================
    Finished build.
======================================================================
======================================================================


Build step 'Execute shell' marked build as failure
Archiving artifacts
Sending artifact delta relative to PreCommit-YARN-Build #4541
Archived 17 artifacts
Archive block size is 32768
Received 221 blocks and 910854 bytes
Compression is 88.8%
Took 0.59 sec
[description-setter] Could not determine description.
Recording test results
Email was triggered for: Failure
Sending email for trigger: Failure



###################################################################################
############################## FAILED TESTS (if any) ##############################
1 tests failed.
FAILED:  org.apache.hadoop.yarn.server.timeline.TestLeveldbTimelineStore.testCheckVersion

Error Message:
Exception message mismatch

Stack Trace:
java.lang.AssertionError: Exception message mismatch
	at org.junit.Assert.fail(Assert.java:88)
	at org.junit.Assert.assertTrue(Assert.java:41)
	at org.apache.hadoop.yarn.server.timeline.TestLeveldbTimelineStore.testCheckVersion(TestLeveldbTimelineStore.java:297)



Mime
  • Unnamed multipart/mixed (inline, None, 0 bytes)
View raw message