hadoop-yarn-dev mailing list archives

Site index · List index
Message view « Date » · « Thread »
Top « Date » · « Thread »
From Apache Jenkins Server <jenk...@builds.apache.org>
Subject Hadoop-Yarn-trunk - Build # 631 - Failure
Date Sat, 02 Aug 2014 11:27:38 GMT
See https://builds.apache.org/job/Hadoop-Yarn-trunk/631/

###################################################################################
########################## LAST 60 LINES OF THE CONSOLE ###########################
[...truncated 16862 lines...]
Failed tests: 
  TestDistributedShell.testDSShell:188 null

Tests run: 8, Failures: 1, Errors: 0, Skipped: 0

[INFO] ------------------------------------------------------------------------
[INFO] Reactor Summary:
[INFO] 
[INFO] hadoop-yarn ....................................... SUCCESS [  2.993 s]
[INFO] hadoop-yarn-api ................................... SUCCESS [02:19 min]
[INFO] hadoop-yarn-common ................................ SUCCESS [02:04 min]
[INFO] hadoop-yarn-server ................................ SUCCESS [  0.083 s]
[INFO] hadoop-yarn-server-common ......................... SUCCESS [ 36.996 s]
[INFO] hadoop-yarn-server-nodemanager .................... SUCCESS [04:47 min]
[INFO] hadoop-yarn-server-web-proxy ...................... SUCCESS [ 18.316 s]
[INFO] hadoop-yarn-server-applicationhistoryservice ...... SUCCESS [01:17 min]
[INFO] hadoop-yarn-server-resourcemanager ................ SUCCESS [27:34 min]
[INFO] hadoop-yarn-server-tests .......................... SUCCESS [01:18 min]
[INFO] hadoop-yarn-client ................................ SUCCESS [09:35 min]
[INFO] hadoop-yarn-applications .......................... SUCCESS [  0.047 s]
[INFO] hadoop-yarn-applications-distributedshell ......... FAILURE [03:33 min]
[INFO] hadoop-yarn-applications-unmanaged-am-launcher .... SKIPPED
[INFO] hadoop-yarn-site .................................. SKIPPED
[INFO] hadoop-yarn-project ............................... SKIPPED
[INFO] ------------------------------------------------------------------------
[INFO] BUILD FAILURE
[INFO] ------------------------------------------------------------------------
[INFO] Total time: 53:31 min
[INFO] Finished at: 2014-08-02T11:26:48+00:00
[INFO] Final Memory: 88M/1018M
[INFO] ------------------------------------------------------------------------
[ERROR] Failed to execute goal org.apache.maven.plugins:maven-surefire-plugin:2.16:test (default-test)
on project hadoop-yarn-applications-distributedshell: There are test failures.
[ERROR] 
[ERROR] Please refer to /home/jenkins/jenkins-slave/workspace/Hadoop-Yarn-trunk/trunk/hadoop-yarn-project/hadoop-yarn/hadoop-yarn-applications/hadoop-yarn-applications-distributedshell/target/surefire-reports
for the individual test results.
[ERROR] -> [Help 1]
[ERROR] 
[ERROR] To see the full stack trace of the errors, re-run Maven with the -e switch.
[ERROR] Re-run Maven using the -X switch to enable full debug logging.
[ERROR] 
[ERROR] For more information about the errors and possible solutions, please read the following
articles:
[ERROR] [Help 1] http://cwiki.apache.org/confluence/display/MAVEN/MojoFailureException
[ERROR] 
[ERROR] After correcting the problems, you can resume the build with the command
[ERROR]   mvn <goals> -rf :hadoop-yarn-applications-distributedshell
Build step 'Execute shell' marked build as failure
Archiving artifacts
Updating HADOOP-10902
Updating HADOOP-10793
Updating HDFS-6802
Updating HADOOP-10900
Updating YARN-2343
Updating HDFS-6482
Updating HDFS-6796
Updating HDFS-6794
Updating HDFS-6788
Updating HADOOP-10920
Sending e-mails to: yarn-dev@hadoop.apache.org
Email was triggered for: Failure
Sending email for trigger: Failure



###################################################################################
############################## FAILED TESTS (if any) ##############################
No tests ran.
Mime
  • Unnamed multipart/mixed (inline, None, 0 bytes)
View raw message