hadoop-yarn-dev mailing list archives

Site index · List index
Message view « Date » · « Thread »
Top « Date » · « Thread »
From Apache Jenkins Server <jenk...@builds.apache.org>
Subject Hadoop-Yarn-trunk - Build # 676 - Still Failing
Date Wed, 10 Sep 2014 11:23:42 GMT
See https://builds.apache.org/job/Hadoop-Yarn-trunk/676/

###################################################################################
########################## LAST 60 LINES OF THE CONSOLE ###########################
[...truncated 8382 lines...]
Running org.apache.hadoop.yarn.client.TestResourceTrackerOnHA

Results :

Tests run: 125, Failures: 0, Errors: 0, Skipped: 0

[INFO] ------------------------------------------------------------------------
[INFO] Reactor Summary:
[INFO] 
[INFO] hadoop-yarn ....................................... SUCCESS [  3.048 s]
[INFO] hadoop-yarn-api ................................... SUCCESS [02:06 min]
[INFO] hadoop-yarn-common ................................ SUCCESS [02:03 min]
[INFO] hadoop-yarn-server ................................ SUCCESS [  0.091 s]
[INFO] hadoop-yarn-server-common ......................... SUCCESS [ 37.505 s]
[INFO] hadoop-yarn-server-nodemanager .................... SUCCESS [04:51 min]
[INFO] hadoop-yarn-server-web-proxy ...................... SUCCESS [ 17.232 s]
[INFO] hadoop-yarn-server-applicationhistoryservice ...... SUCCESS [01:20 min]
[INFO] hadoop-yarn-server-resourcemanager ................ SUCCESS [30:34 min]
[INFO] hadoop-yarn-server-tests .......................... SUCCESS [01:19 min]
[INFO] hadoop-yarn-client ................................ FAILURE [06:26 min]
[INFO] hadoop-yarn-applications .......................... SKIPPED
[INFO] hadoop-yarn-applications-distributedshell ......... SKIPPED
[INFO] hadoop-yarn-applications-unmanaged-am-launcher .... SKIPPED
[INFO] hadoop-yarn-site .................................. SKIPPED
[INFO] hadoop-yarn-project ............................... SKIPPED
[INFO] ------------------------------------------------------------------------
[INFO] BUILD FAILURE
[INFO] ------------------------------------------------------------------------
[INFO] Total time: 49:40 min
[INFO] Finished at: 2014-09-10T11:23:16+00:00
[INFO] Final Memory: 87M/835M
[INFO] ------------------------------------------------------------------------
[ERROR] Failed to execute goal org.apache.maven.plugins:maven-surefire-plugin:2.16:test (default-test)
on project hadoop-yarn-client: ExecutionException; nested exception is java.util.concurrent.ExecutionException:
java.lang.RuntimeException: The forked VM terminated without saying properly goodbye. VM crash
or System.exit called ?
[ERROR] Command was/bin/sh -c cd /home/jenkins/jenkins-slave/workspace/Hadoop-Yarn-trunk/hadoop-yarn-project/hadoop-yarn/hadoop-yarn-client
&& /home/jenkins/tools/java/jdk1.6.0_45-64/jre/bin/java -Xmx1024m -XX:+HeapDumpOnOutOfMemoryError
-jar /home/jenkins/jenkins-slave/workspace/Hadoop-Yarn-trunk/hadoop-yarn-project/hadoop-yarn/hadoop-yarn-client/target/surefire/surefirebooter1121201161894655545.jar
/home/jenkins/jenkins-slave/workspace/Hadoop-Yarn-trunk/hadoop-yarn-project/hadoop-yarn/hadoop-yarn-client/target/surefire/surefire3548513471112421515tmp
/home/jenkins/jenkins-slave/workspace/Hadoop-Yarn-trunk/hadoop-yarn-project/hadoop-yarn/hadoop-yarn-client/target/surefire/surefire_237375285328927376450tmp
[ERROR] -> [Help 1]
[ERROR] 
[ERROR] To see the full stack trace of the errors, re-run Maven with the -e switch.
[ERROR] Re-run Maven using the -X switch to enable full debug logging.
[ERROR] 
[ERROR] For more information about the errors and possible solutions, please read the following
articles:
[ERROR] [Help 1] http://cwiki.apache.org/confluence/display/MAVEN/MojoFailureException
[ERROR] 
[ERROR] After correcting the problems, you can resume the build with the command
[ERROR]   mvn <goals> -rf :hadoop-yarn-client
Build step 'Execute shell' marked build as failure
Archiving artifacts
Updating HADOOP-11077
Updating YARN-2526
Updating HADOOP-11057
Updating HDFS-6776
Updating YARN-1471
Updating HDFS-6482
Updating HADOOP-10925
Updating HADOOP-9989
Updating HADOOP-9374
Updating HDFS-6940
Sending e-mails to: yarn-dev@hadoop.apache.org
Email was triggered for: Failure
Sending email for trigger: Failure



###################################################################################
############################## FAILED TESTS (if any) ##############################
No tests ran.
Mime
  • Unnamed multipart/mixed (inline, None, 0 bytes)
View raw message