hadoop-yarn-dev mailing list archives

Site index · List index
Message view « Date » · « Thread »
Top « Date » · « Thread »
From Apache Jenkins Server <jenk...@builds.apache.org>
Subject Build failed in Jenkins: Hadoop-Yarn-trunk #764
Date Thu, 04 Dec 2014 11:42:28 GMT
See <https://builds.apache.org/job/Hadoop-Yarn-trunk/764/>

------------------------------------------
[...truncated 8018 lines...]
Running org.apache.hadoop.yarn.server.resourcemanager.TestRMEmbeddedElector
Tests run: 1, Failures: 0, Errors: 0, Skipped: 0, Time elapsed: 2.9 sec - in org.apache.hadoop.yarn.server.resourcemanager.TestRMEmbeddedElector
Running org.apache.hadoop.yarn.server.resourcemanager.monitor.capacity.TestProportionalCapacityPreemptionPolicy
Tests run: 18, Failures: 0, Errors: 0, Skipped: 0, Time elapsed: 6.205 sec - in org.apache.hadoop.yarn.server.resourcemanager.monitor.capacity.TestProportionalCapacityPreemptionPolicy
Running org.apache.hadoop.yarn.server.resourcemanager.monitor.TestSchedulingMonitor
Tests run: 1, Failures: 0, Errors: 0, Skipped: 0, Time elapsed: 1.44 sec - in org.apache.hadoop.yarn.server.resourcemanager.monitor.TestSchedulingMonitor
Running org.apache.hadoop.yarn.server.resourcemanager.resource.TestResources
Tests run: 2, Failures: 0, Errors: 0, Skipped: 0, Time elapsed: 0.436 sec - in org.apache.hadoop.yarn.server.resourcemanager.resource.TestResources
Running org.apache.hadoop.yarn.server.resourcemanager.resource.TestResourceWeights
Tests run: 1, Failures: 0, Errors: 0, Skipped: 0, Time elapsed: 0.062 sec - in org.apache.hadoop.yarn.server.resourcemanager.resource.TestResourceWeights
Running org.apache.hadoop.yarn.server.resourcemanager.ahs.TestRMApplicationHistoryWriter
Tests run: 7, Failures: 0, Errors: 0, Skipped: 0, Time elapsed: 187.897 sec - in org.apache.hadoop.yarn.server.resourcemanager.ahs.TestRMApplicationHistoryWriter
Running org.apache.hadoop.yarn.server.resourcemanager.TestRMNodeTransitions
Tests run: 17, Failures: 0, Errors: 0, Skipped: 0, Time elapsed: 1.479 sec - in org.apache.hadoop.yarn.server.resourcemanager.TestRMNodeTransitions
Running org.apache.hadoop.yarn.server.resourcemanager.recovery.TestFSRMStateStore
Tests run: 2, Failures: 0, Errors: 0, Skipped: 0, Time elapsed: 15.916 sec - in org.apache.hadoop.yarn.server.resourcemanager.recovery.TestFSRMStateStore
Running org.apache.hadoop.yarn.server.resourcemanager.recovery.TestZKRMStateStoreZKClientConnections
Tests run: 7, Failures: 0, Errors: 0, Skipped: 0, Time elapsed: 4.641 sec - in org.apache.hadoop.yarn.server.resourcemanager.recovery.TestZKRMStateStoreZKClientConnections
Running org.apache.hadoop.yarn.server.resourcemanager.recovery.TestZKRMStateStore
Tests run: 3, Failures: 0, Errors: 0, Skipped: 0, Time elapsed: 8.16 sec - in org.apache.hadoop.yarn.server.resourcemanager.recovery.TestZKRMStateStore
Running org.apache.hadoop.yarn.server.resourcemanager.recovery.TestLeveldbRMStateStore
Tests run: 7, Failures: 0, Errors: 0, Skipped: 0, Time elapsed: 4.695 sec - in org.apache.hadoop.yarn.server.resourcemanager.recovery.TestLeveldbRMStateStore
Running org.apache.hadoop.yarn.server.resourcemanager.rmapp.TestRMAppTransitions
Tests run: 44, Failures: 0, Errors: 0, Skipped: 0, Time elapsed: 2.964 sec - in org.apache.hadoop.yarn.server.resourcemanager.rmapp.TestRMAppTransitions
Running org.apache.hadoop.yarn.server.resourcemanager.rmapp.attempt.TestRMAppAttemptTransitions
Tests run: 68, Failures: 0, Errors: 0, Skipped: 1, Time elapsed: 5.174 sec - in org.apache.hadoop.yarn.server.resourcemanager.rmapp.attempt.TestRMAppAttemptTransitions
Running org.apache.hadoop.yarn.server.resourcemanager.TestWorkPreservingRMRestart
Tests run: 36, Failures: 0, Errors: 1, Skipped: 0, Time elapsed: 344.763 sec <<<
FAILURE! - in org.apache.hadoop.yarn.server.resourcemanager.TestWorkPreservingRMRestart
testReleasedContainerNotRecovered[0](org.apache.hadoop.yarn.server.resourcemanager.TestWorkPreservingRMRestart)
 Time elapsed: 30.038 sec  <<< ERROR!
java.lang.Exception: test timed out after 30000 milliseconds
	at java.lang.Thread.sleep(Native Method)
	at org.apache.hadoop.test.GenericTestUtils.waitFor(GenericTestUtils.java:120)
	at org.apache.hadoop.yarn.server.resourcemanager.TestWorkPreservingRMRestart.testReleasedContainerNotRecovered(TestWorkPreservingRMRestart.java:889)

Running org.apache.hadoop.yarn.server.resourcemanager.TestApplicationCleanup
Tests run: 6, Failures: 0, Errors: 0, Skipped: 0, Time elapsed: 42.151 sec - in org.apache.hadoop.yarn.server.resourcemanager.TestApplicationCleanup
Running org.apache.hadoop.yarn.server.resourcemanager.TestSubmitApplicationWithRMHA
Tests run: 6, Failures: 0, Errors: 0, Skipped: 0, Time elapsed: 11.33 sec - in org.apache.hadoop.yarn.server.resourcemanager.TestSubmitApplicationWithRMHA
Running org.apache.hadoop.yarn.server.resourcemanager.TestResourceTrackerService
Tests run: 14, Failures: 0, Errors: 0, Skipped: 0, Time elapsed: 56.527 sec - in org.apache.hadoop.yarn.server.resourcemanager.TestResourceTrackerService
Running org.apache.hadoop.yarn.server.resourcemanager.nodelabels.TestRMNodeLabelsManager
Tests run: 6, Failures: 0, Errors: 0, Skipped: 0, Time elapsed: 0.797 sec - in org.apache.hadoop.yarn.server.resourcemanager.nodelabels.TestRMNodeLabelsManager
Running org.apache.hadoop.yarn.server.resourcemanager.TestMoveApplication
Tests run: 4, Failures: 0, Errors: 0, Skipped: 0, Time elapsed: 6.355 sec - in org.apache.hadoop.yarn.server.resourcemanager.TestMoveApplication
Running org.apache.hadoop.yarn.server.resourcemanager.TestApplicationMasterLauncher
Tests run: 2, Failures: 0, Errors: 0, Skipped: 0, Time elapsed: 16.457 sec - in org.apache.hadoop.yarn.server.resourcemanager.TestApplicationMasterLauncher
Running org.apache.hadoop.yarn.server.resourcemanager.reservation.TestCapacityOverTimePolicy
Tests run: 8, Failures: 0, Errors: 0, Skipped: 0, Time elapsed: 3.294 sec - in org.apache.hadoop.yarn.server.resourcemanager.reservation.TestCapacityOverTimePolicy
Running org.apache.hadoop.yarn.server.resourcemanager.reservation.TestNoOverCommitPolicy
Tests run: 6, Failures: 0, Errors: 0, Skipped: 0, Time elapsed: 1.391 sec - in org.apache.hadoop.yarn.server.resourcemanager.reservation.TestNoOverCommitPolicy
Running org.apache.hadoop.yarn.server.resourcemanager.reservation.TestSimpleCapacityReplanner
Tests run: 1, Failures: 0, Errors: 0, Skipped: 0, Time elapsed: 0.707 sec - in org.apache.hadoop.yarn.server.resourcemanager.reservation.TestSimpleCapacityReplanner
Running org.apache.hadoop.yarn.server.resourcemanager.reservation.TestRLESparseResourceAllocation
Tests run: 4, Failures: 0, Errors: 0, Skipped: 0, Time elapsed: 0.462 sec - in org.apache.hadoop.yarn.server.resourcemanager.reservation.TestRLESparseResourceAllocation
Running org.apache.hadoop.yarn.server.resourcemanager.reservation.TestGreedyReservationAgent
Tests run: 9, Failures: 0, Errors: 0, Skipped: 0, Time elapsed: 1.1 sec - in org.apache.hadoop.yarn.server.resourcemanager.reservation.TestGreedyReservationAgent
Running org.apache.hadoop.yarn.server.resourcemanager.reservation.TestReservationInputValidator
Tests run: 23, Failures: 0, Errors: 0, Skipped: 0, Time elapsed: 0.763 sec - in org.apache.hadoop.yarn.server.resourcemanager.reservation.TestReservationInputValidator
Running org.apache.hadoop.yarn.server.resourcemanager.reservation.TestCapacityReservationSystem
Tests run: 2, Failures: 0, Errors: 0, Skipped: 0, Time elapsed: 1.84 sec - in org.apache.hadoop.yarn.server.resourcemanager.reservation.TestCapacityReservationSystem
Running org.apache.hadoop.yarn.server.resourcemanager.reservation.TestInMemoryPlan
Tests run: 8, Failures: 0, Errors: 0, Skipped: 0, Time elapsed: 0.719 sec - in org.apache.hadoop.yarn.server.resourcemanager.reservation.TestInMemoryPlan
Running org.apache.hadoop.yarn.server.resourcemanager.reservation.TestInMemoryReservationAllocation
Tests run: 5, Failures: 0, Errors: 0, Skipped: 0, Time elapsed: 0.479 sec - in org.apache.hadoop.yarn.server.resourcemanager.reservation.TestInMemoryReservationAllocation
Running org.apache.hadoop.yarn.server.resourcemanager.reservation.TestCapacitySchedulerPlanFollower
Tests run: 2, Failures: 0, Errors: 0, Skipped: 0, Time elapsed: 2.109 sec - in org.apache.hadoop.yarn.server.resourcemanager.reservation.TestCapacitySchedulerPlanFollower
Running org.apache.hadoop.yarn.server.resourcemanager.TestClientRMTokens
Tests run: 6, Failures: 0, Errors: 0, Skipped: 0, Time elapsed: 17.605 sec - in org.apache.hadoop.yarn.server.resourcemanager.TestClientRMTokens
Running org.apache.hadoop.yarn.server.resourcemanager.TestRMAdminService
Tests run: 15, Failures: 0, Errors: 0, Skipped: 0, Time elapsed: 9.007 sec - in org.apache.hadoop.yarn.server.resourcemanager.TestRMAdminService
Running org.apache.hadoop.yarn.server.resourcemanager.TestResourceManager
Tests run: 5, Failures: 0, Errors: 0, Skipped: 0, Time elapsed: 24.059 sec - in org.apache.hadoop.yarn.server.resourcemanager.TestResourceManager
Running org.apache.hadoop.yarn.server.resourcemanager.TestRMRestart
Tests run: 48, Failures: 0, Errors: 0, Skipped: 0, Time elapsed: 384.268 sec - in org.apache.hadoop.yarn.server.resourcemanager.TestRMRestart
Running org.apache.hadoop.yarn.server.resourcemanager.security.TestAMRMTokens
Tests run: 6, Failures: 0, Errors: 0, Skipped: 0, Time elapsed: 57.65 sec - in org.apache.hadoop.yarn.server.resourcemanager.security.TestAMRMTokens
Running org.apache.hadoop.yarn.server.resourcemanager.security.TestDelegationTokenRenewerLifecycle
Tests run: 1, Failures: 0, Errors: 0, Skipped: 0, Time elapsed: 0.717 sec - in org.apache.hadoop.yarn.server.resourcemanager.security.TestDelegationTokenRenewerLifecycle
Running org.apache.hadoop.yarn.server.resourcemanager.security.TestRMDelegationTokens
Tests run: 2, Failures: 0, Errors: 0, Skipped: 0, Time elapsed: 5.709 sec - in org.apache.hadoop.yarn.server.resourcemanager.security.TestRMDelegationTokens
Running org.apache.hadoop.yarn.server.resourcemanager.security.TestClientToAMTokens
Tests run: 4, Failures: 0, Errors: 0, Skipped: 0, Time elapsed: 15.541 sec - in org.apache.hadoop.yarn.server.resourcemanager.security.TestClientToAMTokens
Running org.apache.hadoop.yarn.server.resourcemanager.security.TestDelegationTokenRenewer
Tests run: 10, Failures: 0, Errors: 0, Skipped: 0, Time elapsed: 42.509 sec - in org.apache.hadoop.yarn.server.resourcemanager.security.TestDelegationTokenRenewer
Running org.apache.hadoop.yarn.server.resourcemanager.TestRM
Tests run: 22, Failures: 0, Errors: 0, Skipped: 0, Time elapsed: 275.276 sec - in org.apache.hadoop.yarn.server.resourcemanager.TestRM
Running org.apache.hadoop.yarn.server.resourcemanager.TestContainerResourceUsage
Tests run: 4, Failures: 0, Errors: 0, Skipped: 0, Time elapsed: 44.549 sec - in org.apache.hadoop.yarn.server.resourcemanager.TestContainerResourceUsage
Running org.apache.hadoop.yarn.server.resourcemanager.TestKillApplicationWithRMHA
Tests run: 4, Failures: 0, Errors: 0, Skipped: 0, Time elapsed: 25.852 sec - in org.apache.hadoop.yarn.server.resourcemanager.TestKillApplicationWithRMHA
Running org.apache.hadoop.yarn.server.resourcemanager.TestAppManager
Tests run: 12, Failures: 0, Errors: 0, Skipped: 0, Time elapsed: 6.039 sec - in org.apache.hadoop.yarn.server.resourcemanager.TestAppManager
Running org.apache.hadoop.yarn.server.resourcemanager.TestRMHA
Tests run: 8, Failures: 0, Errors: 0, Skipped: 0, Time elapsed: 31.552 sec - in org.apache.hadoop.yarn.server.resourcemanager.TestRMHA
Running org.apache.hadoop.yarn.server.resourcemanager.scheduler.fair.policies.TestDominantResourceFairnessPolicy
Tests run: 9, Failures: 0, Errors: 0, Skipped: 0, Time elapsed: 0.456 sec - in org.apache.hadoop.yarn.server.resourcemanager.scheduler.fair.policies.TestDominantResourceFairnessPolicy
Running org.apache.hadoop.yarn.server.resourcemanager.scheduler.fair.policies.TestEmptyQueues
Tests run: 3, Failures: 0, Errors: 0, Skipped: 0, Time elapsed: 0.447 sec - in org.apache.hadoop.yarn.server.resourcemanager.scheduler.fair.policies.TestEmptyQueues
Running org.apache.hadoop.yarn.server.resourcemanager.scheduler.fair.TestFairScheduler
Tests run: 81, Failures: 0, Errors: 0, Skipped: 0, Time elapsed: 8.51 sec - in org.apache.hadoop.yarn.server.resourcemanager.scheduler.fair.TestFairScheduler
Running org.apache.hadoop.yarn.server.resourcemanager.scheduler.fair.TestAllocationFileLoaderService
Tests run: 7, Failures: 0, Errors: 0, Skipped: 0, Time elapsed: 0.774 sec - in org.apache.hadoop.yarn.server.resourcemanager.scheduler.fair.TestAllocationFileLoaderService
Running org.apache.hadoop.yarn.server.resourcemanager.scheduler.fair.TestMaxRunningAppsEnforcer
Tests run: 6, Failures: 0, Errors: 0, Skipped: 0, Time elapsed: 1.309 sec - in org.apache.hadoop.yarn.server.resourcemanager.scheduler.fair.TestMaxRunningAppsEnforcer
Running org.apache.hadoop.yarn.server.resourcemanager.scheduler.fair.TestFairSchedulerQueueACLs
Tests run: 1, Failures: 0, Errors: 0, Skipped: 0, Time elapsed: 53.923 sec - in org.apache.hadoop.yarn.server.resourcemanager.scheduler.fair.TestFairSchedulerQueueACLs
Running org.apache.hadoop.yarn.server.resourcemanager.scheduler.fair.TestQueuePlacementPolicy
Tests run: 16, Failures: 0, Errors: 0, Skipped: 0, Time elapsed: 0.573 sec - in org.apache.hadoop.yarn.server.resourcemanager.scheduler.fair.TestQueuePlacementPolicy
Running org.apache.hadoop.yarn.server.resourcemanager.scheduler.fair.TestFairSchedulerConfiguration
Tests run: 5, Failures: 0, Errors: 0, Skipped: 0, Time elapsed: 0.435 sec - in org.apache.hadoop.yarn.server.resourcemanager.scheduler.fair.TestFairSchedulerConfiguration
Running org.apache.hadoop.yarn.server.resourcemanager.scheduler.fair.TestFairSchedulerFairShare
Tests run: 6, Failures: 0, Errors: 0, Skipped: 0, Time elapsed: 3.402 sec - in org.apache.hadoop.yarn.server.resourcemanager.scheduler.fair.TestFairSchedulerFairShare
Running org.apache.hadoop.yarn.server.resourcemanager.scheduler.fair.TestSchedulingPolicy
Tests run: 2, Failures: 0, Errors: 0, Skipped: 0, Time elapsed: 0.579 sec - in org.apache.hadoop.yarn.server.resourcemanager.scheduler.fair.TestSchedulingPolicy
Running org.apache.hadoop.yarn.server.resourcemanager.scheduler.fair.TestFSAppAttempt
Tests run: 4, Failures: 0, Errors: 0, Skipped: 0, Time elapsed: 2.031 sec - in org.apache.hadoop.yarn.server.resourcemanager.scheduler.fair.TestFSAppAttempt
Running org.apache.hadoop.yarn.server.resourcemanager.scheduler.fair.TestQueueManager
Tests run: 2, Failures: 0, Errors: 0, Skipped: 0, Time elapsed: 1.046 sec - in org.apache.hadoop.yarn.server.resourcemanager.scheduler.fair.TestQueueManager
Running org.apache.hadoop.yarn.server.resourcemanager.scheduler.fair.TestFSLeafQueue
Tests run: 3, Failures: 0, Errors: 0, Skipped: 0, Time elapsed: 2.333 sec - in org.apache.hadoop.yarn.server.resourcemanager.scheduler.fair.TestFSLeafQueue
Running org.apache.hadoop.yarn.server.resourcemanager.scheduler.fair.TestFairSchedulerPreemption
Tests run: 1, Failures: 0, Errors: 0, Skipped: 0, Time elapsed: 2.238 sec - in org.apache.hadoop.yarn.server.resourcemanager.scheduler.fair.TestFairSchedulerPreemption
Running org.apache.hadoop.yarn.server.resourcemanager.scheduler.fair.TestFairSchedulerEventLog
Tests run: 1, Failures: 0, Errors: 0, Skipped: 0, Time elapsed: 1.44 sec - in org.apache.hadoop.yarn.server.resourcemanager.scheduler.fair.TestFairSchedulerEventLog
Running org.apache.hadoop.yarn.server.resourcemanager.scheduler.fair.TestComputeFairShares
Tests run: 9, Failures: 0, Errors: 0, Skipped: 0, Time elapsed: 0.453 sec - in org.apache.hadoop.yarn.server.resourcemanager.scheduler.fair.TestComputeFairShares
Running org.apache.hadoop.yarn.server.resourcemanager.scheduler.fifo.TestFifoScheduler
Tests run: 7, Failures: 0, Errors: 0, Skipped: 0, Time elapsed: 2.423 sec - in org.apache.hadoop.yarn.server.resourcemanager.scheduler.fifo.TestFifoScheduler
Running org.apache.hadoop.yarn.server.resourcemanager.scheduler.TestSchedulerApplicationAttempt
Tests run: 1, Failures: 0, Errors: 0, Skipped: 0, Time elapsed: 0.84 sec - in org.apache.hadoop.yarn.server.resourcemanager.scheduler.TestSchedulerApplicationAttempt
Running org.apache.hadoop.yarn.server.resourcemanager.scheduler.capacity.TestCapacitySchedulerDynamicBehavior
Tests run: 4, Failures: 0, Errors: 0, Skipped: 0, Time elapsed: 8.294 sec - in org.apache.hadoop.yarn.server.resourcemanager.scheduler.capacity.TestCapacitySchedulerDynamicBehavior
Running org.apache.hadoop.yarn.server.resourcemanager.scheduler.capacity.TestApplicationLimits
Tests run: 4, Failures: 0, Errors: 0, Skipped: 0, Time elapsed: 2.46 sec - in org.apache.hadoop.yarn.server.resourcemanager.scheduler.capacity.TestApplicationLimits
Running org.apache.hadoop.yarn.server.resourcemanager.scheduler.capacity.TestReservationQueue
Tests run: 1, Failures: 0, Errors: 0, Skipped: 0, Time elapsed: 1.381 sec - in org.apache.hadoop.yarn.server.resourcemanager.scheduler.capacity.TestReservationQueue
Running org.apache.hadoop.yarn.server.resourcemanager.scheduler.capacity.TestQueueParsing
Tests run: 10, Failures: 0, Errors: 0, Skipped: 0, Time elapsed: 2.227 sec - in org.apache.hadoop.yarn.server.resourcemanager.scheduler.capacity.TestQueueParsing
Running org.apache.hadoop.yarn.server.resourcemanager.scheduler.capacity.TestParentQueue
Tests run: 9, Failures: 0, Errors: 0, Skipped: 0, Time elapsed: 3.704 sec - in org.apache.hadoop.yarn.server.resourcemanager.scheduler.capacity.TestParentQueue
Running org.apache.hadoop.yarn.server.resourcemanager.scheduler.capacity.TestCapacitySchedulerQueueACLs
Tests run: 1, Failures: 0, Errors: 0, Skipped: 0, Time elapsed: 53.875 sec - in org.apache.hadoop.yarn.server.resourcemanager.scheduler.capacity.TestCapacitySchedulerQueueACLs
Running org.apache.hadoop.yarn.server.resourcemanager.scheduler.capacity.TestLeafQueue
Tests run: 23, Failures: 0, Errors: 0, Skipped: 0, Time elapsed: 8.158 sec - in org.apache.hadoop.yarn.server.resourcemanager.scheduler.capacity.TestLeafQueue
Running org.apache.hadoop.yarn.server.resourcemanager.scheduler.capacity.TestChildQueueOrder
Tests run: 1, Failures: 0, Errors: 0, Skipped: 0, Time elapsed: 2.345 sec - in org.apache.hadoop.yarn.server.resourcemanager.scheduler.capacity.TestChildQueueOrder
Running org.apache.hadoop.yarn.server.resourcemanager.scheduler.capacity.TestCSQueueUtils
Tests run: 3, Failures: 0, Errors: 0, Skipped: 0, Time elapsed: 1.678 sec - in org.apache.hadoop.yarn.server.resourcemanager.scheduler.capacity.TestCSQueueUtils
Running org.apache.hadoop.yarn.server.resourcemanager.scheduler.capacity.TestQueueMappings
Tests run: 1, Failures: 0, Errors: 0, Skipped: 0, Time elapsed: 10.368 sec - in org.apache.hadoop.yarn.server.resourcemanager.scheduler.capacity.TestQueueMappings
Running org.apache.hadoop.yarn.server.resourcemanager.scheduler.capacity.TestCapacityScheduler
Tests run: 30, Failures: 0, Errors: 0, Skipped: 0, Time elapsed: 98.947 sec - in org.apache.hadoop.yarn.server.resourcemanager.scheduler.capacity.TestCapacityScheduler
Running org.apache.hadoop.yarn.server.resourcemanager.scheduler.capacity.TestReservations
Tests run: 9, Failures: 0, Errors: 0, Skipped: 0, Time elapsed: 3.613 sec - in org.apache.hadoop.yarn.server.resourcemanager.scheduler.capacity.TestReservations
Running org.apache.hadoop.yarn.server.resourcemanager.scheduler.capacity.TestContainerAllocation
Tests run: 9, Failures: 0, Errors: 1, Skipped: 0, Time elapsed: 439.686 sec <<< FAILURE!
- in org.apache.hadoop.yarn.server.resourcemanager.scheduler.capacity.TestContainerAllocation
testContainerAllocateWithDefaultQueueLabels(org.apache.hadoop.yarn.server.resourcemanager.scheduler.capacity.TestContainerAllocation)
 Time elapsed: 120.039 sec  <<< ERROR!
java.lang.Exception: test timed out after 120000 milliseconds
	at java.lang.Thread.sleep(Native Method)
	at org.apache.hadoop.yarn.server.resourcemanager.MockRM.waitForState(MockRM.java:209)
	at org.apache.hadoop.yarn.server.resourcemanager.scheduler.capacity.TestContainerAllocation.testContainerAllocateWithDefaultQueueLabels(TestContainerAllocation.java:764)

Running org.apache.hadoop.yarn.server.resourcemanager.scheduler.TestSchedulerUtils
Tests run: 8, Failures: 0, Errors: 0, Skipped: 0, Time elapsed: 5.2 sec - in org.apache.hadoop.yarn.server.resourcemanager.scheduler.TestSchedulerUtils
Running org.apache.hadoop.yarn.server.resourcemanager.scheduler.TestAbstractYarnScheduler
Tests run: 4, Failures: 0, Errors: 0, Skipped: 0, Time elapsed: 2.557 sec - in org.apache.hadoop.yarn.server.resourcemanager.scheduler.TestAbstractYarnScheduler
Running org.apache.hadoop.yarn.server.resourcemanager.scheduler.TestQueueMetrics
Tests run: 7, Failures: 0, Errors: 0, Skipped: 0, Time elapsed: 2.65 sec - in org.apache.hadoop.yarn.server.resourcemanager.scheduler.TestQueueMetrics
Running org.apache.hadoop.yarn.server.resourcemanager.TestApplicationMasterService
Tests run: 5, Failures: 0, Errors: 0, Skipped: 0, Time elapsed: 42.015 sec - in org.apache.hadoop.yarn.server.resourcemanager.TestApplicationMasterService
Running org.apache.hadoop.yarn.server.resourcemanager.TestRMProxyUsersConf
Tests run: 3, Failures: 0, Errors: 0, Skipped: 0, Time elapsed: 31.861 sec - in org.apache.hadoop.yarn.server.resourcemanager.TestRMProxyUsersConf
Running org.apache.hadoop.yarn.server.resourcemanager.resourcetracker.TestRMNMRPCResponseId
Tests run: 1, Failures: 0, Errors: 0, Skipped: 0, Time elapsed: 1.206 sec - in org.apache.hadoop.yarn.server.resourcemanager.resourcetracker.TestRMNMRPCResponseId
Running org.apache.hadoop.yarn.server.resourcemanager.resourcetracker.TestNMReconnect
Tests run: 1, Failures: 0, Errors: 0, Skipped: 0, Time elapsed: 1.506 sec - in org.apache.hadoop.yarn.server.resourcemanager.resourcetracker.TestNMReconnect
Running org.apache.hadoop.yarn.server.resourcemanager.resourcetracker.TestNMExpiry
Tests run: 1, Failures: 0, Errors: 0, Skipped: 0, Time elapsed: 3.312 sec - in org.apache.hadoop.yarn.server.resourcemanager.resourcetracker.TestNMExpiry
Running org.apache.hadoop.yarn.server.resourcemanager.TestApplicationACLs
Tests run: 1, Failures: 0, Errors: 0, Skipped: 0, Time elapsed: 21.749 sec - in org.apache.hadoop.yarn.server.resourcemanager.TestApplicationACLs
Running org.apache.hadoop.yarn.server.resourcemanager.TestClientRMService
Tests run: 23, Failures: 0, Errors: 0, Skipped: 0, Time elapsed: 10.765 sec - in org.apache.hadoop.yarn.server.resourcemanager.TestClientRMService
Running org.apache.hadoop.yarn.server.resourcemanager.metrics.TestSystemMetricsPublisher
Tests run: 3, Failures: 0, Errors: 0, Skipped: 0, Time elapsed: 5.028 sec - in org.apache.hadoop.yarn.server.resourcemanager.metrics.TestSystemMetricsPublisher
Running org.apache.hadoop.yarn.server.resourcemanager.applicationsmanager.TestAMRMRPCResponseId
Tests run: 1, Failures: 0, Errors: 0, Skipped: 0, Time elapsed: 5.768 sec - in org.apache.hadoop.yarn.server.resourcemanager.applicationsmanager.TestAMRMRPCResponseId
Running org.apache.hadoop.yarn.server.resourcemanager.applicationsmanager.TestAMRMRPCNodeUpdates
Tests run: 1, Failures: 0, Errors: 0, Skipped: 0, Time elapsed: 9.762 sec - in org.apache.hadoop.yarn.server.resourcemanager.applicationsmanager.TestAMRMRPCNodeUpdates
Running org.apache.hadoop.yarn.server.resourcemanager.applicationsmanager.TestAMRestart
Tests run: 6, Failures: 0, Errors: 0, Skipped: 0, Time elapsed: 116.898 sec - in org.apache.hadoop.yarn.server.resourcemanager.applicationsmanager.TestAMRestart
Running org.apache.hadoop.yarn.server.resourcemanager.TestRMAuditLogger
Tests run: 3, Failures: 0, Errors: 0, Skipped: 0, Time elapsed: 1.011 sec - in org.apache.hadoop.yarn.server.resourcemanager.TestRMAuditLogger
Running org.apache.hadoop.yarn.server.resourcemanager.TestFifoScheduler
Tests run: 10, Failures: 0, Errors: 0, Skipped: 0, Time elapsed: 30.966 sec - in org.apache.hadoop.yarn.server.resourcemanager.TestFifoScheduler
Running org.apache.hadoop.yarn.server.resourcemanager.TestAMAuthorization
Tests run: 4, Failures: 0, Errors: 0, Skipped: 0, Time elapsed: 14.658 sec - in org.apache.hadoop.yarn.server.resourcemanager.TestAMAuthorization

Results :

Tests in error: 
  TestWorkPreservingRMRestart.testReleasedContainerNotRecovered:889 »  test time...
  TestContainerAllocation.testContainerAllocateWithDefaultQueueLabels:764 »  tes...

Tests run: 969, Failures: 0, Errors: 2, Skipped: 1

[INFO] ------------------------------------------------------------------------
[INFO] Reactor Summary:
[INFO] 
[INFO] hadoop-yarn ....................................... SUCCESS [  2.884 s]
[INFO] hadoop-yarn-api ................................... SUCCESS [03:01 min]
[INFO] hadoop-yarn-common ................................ SUCCESS [02:32 min]
[INFO] hadoop-yarn-server ................................ SUCCESS [  0.083 s]
[INFO] hadoop-yarn-server-common ......................... SUCCESS [ 37.024 s]
[INFO] hadoop-yarn-server-nodemanager .................... SUCCESS [06:23 min]
[INFO] hadoop-yarn-server-web-proxy ...................... SUCCESS [ 17.063 s]
[INFO] hadoop-yarn-server-applicationhistoryservice ...... SUCCESS [03:24 min]
[INFO] hadoop-yarn-server-resourcemanager ................ FAILURE [53:44 min]
[INFO] hadoop-yarn-server-tests .......................... SKIPPED
[INFO] hadoop-yarn-client ................................ SKIPPED
[INFO] hadoop-yarn-server-sharedcachemanager ............. SKIPPED
[INFO] hadoop-yarn-applications .......................... SKIPPED
[INFO] hadoop-yarn-applications-distributedshell ......... SKIPPED
[INFO] hadoop-yarn-applications-unmanaged-am-launcher .... SKIPPED
[INFO] hadoop-yarn-site .................................. SKIPPED
[INFO] hadoop-yarn-registry .............................. SKIPPED
[INFO] hadoop-yarn-project ............................... SKIPPED
[INFO] ------------------------------------------------------------------------
[INFO] BUILD FAILURE
[INFO] ------------------------------------------------------------------------
[INFO] Total time: 01:10 h
[INFO] Finished at: 2014-12-04T11:42:14+00:00
[INFO] Final Memory: 70M/700M
[INFO] ------------------------------------------------------------------------
[ERROR] Failed to execute goal org.apache.maven.plugins:maven-surefire-plugin:2.16:test (default-test)
on project hadoop-yarn-server-resourcemanager: There are test failures.
[ERROR] 
[ERROR] Please refer to <https://builds.apache.org/job/Hadoop-Yarn-trunk/ws/hadoop-yarn-project/hadoop-yarn/hadoop-yarn-server/hadoop-yarn-server-resourcemanager/target/surefire-reports>
for the individual test results.
[ERROR] -> [Help 1]
[ERROR] 
[ERROR] To see the full stack trace of the errors, re-run Maven with the -e switch.
[ERROR] Re-run Maven using the -X switch to enable full debug logging.
[ERROR] 
[ERROR] For more information about the errors and possible solutions, please read the following
articles:
[ERROR] [Help 1] http://cwiki.apache.org/confluence/display/MAVEN/MojoFailureException
[ERROR] 
[ERROR] After correcting the problems, you can resume the build with the command
[ERROR]   mvn <goals> -rf :hadoop-yarn-server-resourcemanager
Build step 'Execute shell' marked build as failure
Archiving artifacts
Recording test results

Mime
View raw message