hadoop-yarn-dev mailing list archives

Site index · List index
Message view « Date » · « Thread »
Top « Date » · « Thread »
From Apache Jenkins Server <jenk...@builds.apache.org>
Subject Build failed in Jenkins: Hadoop-Yarn-trunk-Java8 #78
Date Mon, 19 Jan 2015 11:44:45 GMT
See <https://builds.apache.org/job/Hadoop-Yarn-trunk-Java8/78/changes>

Changes:

[junping_du] YARN-3070. TestRMAdminCLI#testHelp fails for transitionToActive command. (Contributed
by Junping Du)

------------------------------------------
[...truncated 4726 lines...]
[INFO] There are 16158 checkstyle errors.
[WARNING] Unable to locate Source XRef to link to - DISABLED
[INFO] 
[INFO] --- findbugs-maven-plugin:3.0.0:findbugs (default-cli) @ hadoop-yarn-server-resourcemanager
---
[INFO] Fork Value is true
[INFO] Done FindBugs Analysis....
[INFO]                                                                         
[INFO] ------------------------------------------------------------------------
[INFO] Building hadoop-yarn-server-tests 3.0.0-SNAPSHOT
[INFO] ------------------------------------------------------------------------
[WARNING] The POM for org.eclipse.m2e:lifecycle-mapping:jar:1.0.0 is missing, no dependency
information available
[WARNING] Failed to retrieve plugin descriptor for org.eclipse.m2e:lifecycle-mapping:1.0.0:
Plugin org.eclipse.m2e:lifecycle-mapping:1.0.0 or one of its dependencies could not be resolved:
Failure to find org.eclipse.m2e:lifecycle-mapping:jar:1.0.0 in http://repo.maven.apache.org/maven2
was cached in the local repository, resolution will not be reattempted until the update interval
of central has elapsed or updates are forced
[INFO] 
[INFO] --- maven-clean-plugin:2.4.1:clean (default-clean) @ hadoop-yarn-server-tests ---
[INFO] Deleting <https://builds.apache.org/job/Hadoop-Yarn-trunk-Java8/ws/hadoop-yarn-project/hadoop-yarn/hadoop-yarn-server/hadoop-yarn-server-tests/target>
[INFO] 
[INFO] --- maven-antrun-plugin:1.7:run (create-testdirs) @ hadoop-yarn-server-tests ---
[INFO] Executing tasks

main:
    [mkdir] Created dir: <https://builds.apache.org/job/Hadoop-Yarn-trunk-Java8/ws/hadoop-yarn-project/hadoop-yarn/hadoop-yarn-server/hadoop-yarn-server-tests/target/test-dir>
[INFO] Executed tasks
[INFO] 
[INFO] --- hadoop-maven-plugins:3.0.0-SNAPSHOT:protoc (compile-protoc) @ hadoop-yarn-server-tests
---
[INFO] 
[INFO] --- maven-resources-plugin:2.2:resources (default-resources) @ hadoop-yarn-server-tests
---
[INFO] Using default encoding to copy filtered resources.
[INFO] 
[INFO] --- maven-compiler-plugin:2.5.1:compile (default-compile) @ hadoop-yarn-server-tests
---
[INFO] Compiling 1 source file to <https://builds.apache.org/job/Hadoop-Yarn-trunk-Java8/ws/hadoop-yarn-project/hadoop-yarn/hadoop-yarn-server/hadoop-yarn-server-tests/target/classes>
[INFO] 
[INFO] --- maven-resources-plugin:2.2:testResources (default-testResources) @ hadoop-yarn-server-tests
---
[INFO] Using default encoding to copy filtered resources.
[INFO] 
[INFO] --- maven-compiler-plugin:2.5.1:testCompile (default-testCompile) @ hadoop-yarn-server-tests
---
[INFO] Compiling 7 source files to <https://builds.apache.org/job/Hadoop-Yarn-trunk-Java8/ws/hadoop-yarn-project/hadoop-yarn/hadoop-yarn-server/hadoop-yarn-server-tests/target/test-classes>
[INFO] 
[INFO] --- maven-jar-plugin:2.3.1:test-jar (default) @ hadoop-yarn-server-tests ---
[INFO] Building jar: <https://builds.apache.org/job/Hadoop-Yarn-trunk-Java8/ws/hadoop-yarn-project/hadoop-yarn/hadoop-yarn-server/hadoop-yarn-server-tests/target/hadoop-yarn-server-tests-3.0.0-SNAPSHOT-tests.jar>
[INFO] 
[INFO] --- maven-surefire-plugin:2.17:test (default-test) @ hadoop-yarn-server-tests ---
[INFO] Surefire report directory: <https://builds.apache.org/job/Hadoop-Yarn-trunk-Java8/ws/hadoop-yarn-project/hadoop-yarn/hadoop-yarn-server/hadoop-yarn-server-tests/target/surefire-reports>

-------------------------------------------------------
 T E S T S
-------------------------------------------------------

-------------------------------------------------------
 T E S T S
-------------------------------------------------------
Java HotSpot(TM) 64-Bit Server VM warning: ignoring option MaxPermSize=768m; support was removed
in 8.0
Running org.apache.hadoop.yarn.server.TestRMNMSecretKeys
Tests run: 1, Failures: 0, Errors: 0, Skipped: 0, Time elapsed: 1.971 sec - in org.apache.hadoop.yarn.server.TestRMNMSecretKeys
Java HotSpot(TM) 64-Bit Server VM warning: ignoring option MaxPermSize=768m; support was removed
in 8.0
Running org.apache.hadoop.yarn.server.TestContainerManagerSecurity
Tests run: 4, Failures: 0, Errors: 0, Skipped: 0, Time elapsed: 85.889 sec - in org.apache.hadoop.yarn.server.TestContainerManagerSecurity
Java HotSpot(TM) 64-Bit Server VM warning: ignoring option MaxPermSize=768m; support was removed
in 8.0
Running org.apache.hadoop.yarn.server.TestDiskFailures
Tests run: 3, Failures: 0, Errors: 0, Skipped: 0, Time elapsed: 18.372 sec - in org.apache.hadoop.yarn.server.TestDiskFailures
Java HotSpot(TM) 64-Bit Server VM warning: ignoring option MaxPermSize=768m; support was removed
in 8.0
Running org.apache.hadoop.yarn.server.TestMiniYARNClusterForHA
Tests run: 1, Failures: 0, Errors: 0, Skipped: 0, Time elapsed: 5.703 sec - in org.apache.hadoop.yarn.server.TestMiniYARNClusterForHA

Results :

Tests run: 9, Failures: 0, Errors: 0, Skipped: 0

[INFO] 
[INFO] --- maven-jar-plugin:2.3.1:jar (default-jar) @ hadoop-yarn-server-tests ---
[INFO] Building jar: <https://builds.apache.org/job/Hadoop-Yarn-trunk-Java8/ws/hadoop-yarn-project/hadoop-yarn/hadoop-yarn-server/hadoop-yarn-server-tests/target/hadoop-yarn-server-tests-3.0.0-SNAPSHOT.jar>
[INFO] 
[INFO] --- maven-source-plugin:2.1.2:jar-no-fork (hadoop-java-sources) @ hadoop-yarn-server-tests
---
[INFO] Building jar: <https://builds.apache.org/job/Hadoop-Yarn-trunk-Java8/ws/hadoop-yarn-project/hadoop-yarn/hadoop-yarn-server/hadoop-yarn-server-tests/target/hadoop-yarn-server-tests-3.0.0-SNAPSHOT-sources.jar>
[INFO] 
[INFO] --- maven-source-plugin:2.1.2:test-jar-no-fork (hadoop-java-sources) @ hadoop-yarn-server-tests
---
[INFO] Building jar: <https://builds.apache.org/job/Hadoop-Yarn-trunk-Java8/ws/hadoop-yarn-project/hadoop-yarn/hadoop-yarn-server/hadoop-yarn-server-tests/target/hadoop-yarn-server-tests-3.0.0-SNAPSHOT-test-sources.jar>
[INFO] 
[INFO] --- maven-enforcer-plugin:1.3.1:enforce (dist-enforce) @ hadoop-yarn-server-tests ---
[INFO] 
[INFO] --- maven-site-plugin:3.4:attach-descriptor (attach-descriptor) @ hadoop-yarn-server-tests
---
[INFO] 
[INFO] --- maven-javadoc-plugin:2.8.1:jar (module-javadocs) @ hadoop-yarn-server-tests ---
[INFO] Skipping javadoc generation
[INFO] 
[INFO] --- maven-enforcer-plugin:1.3.1:enforce (depcheck) @ hadoop-yarn-server-tests ---
[INFO] 
[INFO] --- maven-checkstyle-plugin:2.6:checkstyle (default-cli) @ hadoop-yarn-server-tests
---
[INFO] 
[INFO] --- findbugs-maven-plugin:3.0.0:findbugs (default-cli) @ hadoop-yarn-server-tests ---
[INFO] Fork Value is true
[INFO] Done FindBugs Analysis....
[INFO]                                                                         
[INFO] ------------------------------------------------------------------------
[INFO] Building hadoop-yarn-client 3.0.0-SNAPSHOT
[INFO] ------------------------------------------------------------------------
[WARNING] The POM for org.eclipse.m2e:lifecycle-mapping:jar:1.0.0 is missing, no dependency
information available
[WARNING] Failed to retrieve plugin descriptor for org.eclipse.m2e:lifecycle-mapping:1.0.0:
Plugin org.eclipse.m2e:lifecycle-mapping:1.0.0 or one of its dependencies could not be resolved:
Failure to find org.eclipse.m2e:lifecycle-mapping:jar:1.0.0 in http://repo.maven.apache.org/maven2
was cached in the local repository, resolution will not be reattempted until the update interval
of central has elapsed or updates are forced
[INFO] 
[INFO] --- maven-clean-plugin:2.4.1:clean (default-clean) @ hadoop-yarn-client ---
[INFO] Deleting <https://builds.apache.org/job/Hadoop-Yarn-trunk-Java8/ws/hadoop-yarn-project/hadoop-yarn/hadoop-yarn-client/target>
[INFO] 
[INFO] --- maven-antrun-plugin:1.7:run (create-testdirs) @ hadoop-yarn-client ---
[INFO] Executing tasks

main:
    [mkdir] Created dir: <https://builds.apache.org/job/Hadoop-Yarn-trunk-Java8/ws/hadoop-yarn-project/hadoop-yarn/hadoop-yarn-client/target/test-dir>
[INFO] Executed tasks
[INFO] 
[INFO] --- hadoop-maven-plugins:3.0.0-SNAPSHOT:protoc (compile-protoc) @ hadoop-yarn-client
---
[INFO] 
[INFO] --- maven-resources-plugin:2.2:resources (default-resources) @ hadoop-yarn-client ---
[INFO] Using default encoding to copy filtered resources.
[INFO] 
[INFO] --- maven-compiler-plugin:2.5.1:compile (default-compile) @ hadoop-yarn-client ---
[INFO] Compiling 31 source files to <https://builds.apache.org/job/Hadoop-Yarn-trunk-Java8/ws/hadoop-yarn-project/hadoop-yarn/hadoop-yarn-client/target/classes>
[INFO] 
[INFO] --- maven-resources-plugin:2.2:testResources (default-testResources) @ hadoop-yarn-client
---
[INFO] Using default encoding to copy filtered resources.
[INFO] 
[INFO] --- maven-compiler-plugin:2.5.1:testCompile (default-testCompile) @ hadoop-yarn-client
---
[INFO] Compiling 22 source files to <https://builds.apache.org/job/Hadoop-Yarn-trunk-Java8/ws/hadoop-yarn-project/hadoop-yarn/hadoop-yarn-client/target/test-classes>
[INFO] 
[INFO] --- maven-surefire-plugin:2.17:test (default-test) @ hadoop-yarn-client ---
[INFO] Surefire report directory: <https://builds.apache.org/job/Hadoop-Yarn-trunk-Java8/ws/hadoop-yarn-project/hadoop-yarn/hadoop-yarn-client/target/surefire-reports>

-------------------------------------------------------
 T E S T S
-------------------------------------------------------

-------------------------------------------------------
 T E S T S
-------------------------------------------------------
Java HotSpot(TM) 64-Bit Server VM warning: ignoring option MaxPermSize=768m; support was removed
in 8.0
Running org.apache.hadoop.yarn.client.TestYarnApiClasses
Tests run: 3, Failures: 0, Errors: 0, Skipped: 0, Time elapsed: 0.33 sec - in org.apache.hadoop.yarn.client.TestYarnApiClasses
Java HotSpot(TM) 64-Bit Server VM warning: ignoring option MaxPermSize=768m; support was removed
in 8.0
Running org.apache.hadoop.yarn.client.api.async.impl.TestAMRMClientAsync
Tests run: 9, Failures: 0, Errors: 0, Skipped: 0, Time elapsed: 2.845 sec - in org.apache.hadoop.yarn.client.api.async.impl.TestAMRMClientAsync
Java HotSpot(TM) 64-Bit Server VM warning: ignoring option MaxPermSize=768m; support was removed
in 8.0
Running org.apache.hadoop.yarn.client.api.async.impl.TestNMClientAsync
Tests run: 2, Failures: 0, Errors: 0, Skipped: 0, Time elapsed: 0.802 sec - in org.apache.hadoop.yarn.client.api.async.impl.TestNMClientAsync
Java HotSpot(TM) 64-Bit Server VM warning: ignoring option MaxPermSize=768m; support was removed
in 8.0
Running org.apache.hadoop.yarn.client.api.impl.TestSharedCacheClientImpl
Tests run: 6, Failures: 0, Errors: 0, Skipped: 0, Time elapsed: 1.121 sec - in org.apache.hadoop.yarn.client.api.impl.TestSharedCacheClientImpl
Java HotSpot(TM) 64-Bit Server VM warning: ignoring option MaxPermSize=768m; support was removed
in 8.0
Running org.apache.hadoop.yarn.client.api.impl.TestAMRMClient
Tests run: 9, Failures: 1, Errors: 0, Skipped: 0, Time elapsed: 51.298 sec <<< FAILURE!
- in org.apache.hadoop.yarn.client.api.impl.TestAMRMClient
testAMRMClientOnAMRMTokenRollOver(org.apache.hadoop.yarn.client.api.impl.TestAMRMClient) 
Time elapsed: 27.157 sec  <<< FAILURE!
java.lang.AssertionError: null
	at org.junit.Assert.fail(Assert.java:86)
	at org.junit.Assert.assertTrue(Assert.java:41)
	at org.junit.Assert.assertTrue(Assert.java:52)
	at org.apache.hadoop.yarn.client.api.impl.TestAMRMClient.testAMRMClientOnAMRMTokenRollOver(TestAMRMClient.java:1007)

Java HotSpot(TM) 64-Bit Server VM warning: ignoring option MaxPermSize=768m; support was removed
in 8.0
Running org.apache.hadoop.yarn.client.api.impl.TestAMRMClientOnRMRestart
Tests run: 3, Failures: 0, Errors: 0, Skipped: 0, Time elapsed: 38.474 sec - in org.apache.hadoop.yarn.client.api.impl.TestAMRMClientOnRMRestart
Java HotSpot(TM) 64-Bit Server VM warning: ignoring option MaxPermSize=768m; support was removed
in 8.0
Running org.apache.hadoop.yarn.client.api.impl.TestNMClient
Tests run: 2, Failures: 0, Errors: 0, Skipped: 0, Time elapsed: 72.23 sec - in org.apache.hadoop.yarn.client.api.impl.TestNMClient
Java HotSpot(TM) 64-Bit Server VM warning: ignoring option MaxPermSize=768m; support was removed
in 8.0
Running org.apache.hadoop.yarn.client.api.impl.TestAHSClient
Tests run: 7, Failures: 0, Errors: 0, Skipped: 0, Time elapsed: 1.029 sec - in org.apache.hadoop.yarn.client.api.impl.TestAHSClient
Java HotSpot(TM) 64-Bit Server VM warning: ignoring option MaxPermSize=768m; support was removed
in 8.0
Running org.apache.hadoop.yarn.client.api.impl.TestYarnClient
Tests run: 16, Failures: 0, Errors: 0, Skipped: 0, Time elapsed: 26.598 sec - in org.apache.hadoop.yarn.client.api.impl.TestYarnClient
Java HotSpot(TM) 64-Bit Server VM warning: ignoring option MaxPermSize=768m; support was removed
in 8.0
Running org.apache.hadoop.yarn.client.api.impl.TestAMRMClientContainerRequest
Tests run: 5, Failures: 0, Errors: 0, Skipped: 0, Time elapsed: 32.335 sec - in org.apache.hadoop.yarn.client.api.impl.TestAMRMClientContainerRequest
Java HotSpot(TM) 64-Bit Server VM warning: ignoring option MaxPermSize=768m; support was removed
in 8.0
Running org.apache.hadoop.yarn.client.TestApplicationMasterServiceProtocolOnHA
Tests run: 3, Failures: 0, Errors: 0, Skipped: 0, Time elapsed: 15.902 sec - in org.apache.hadoop.yarn.client.TestApplicationMasterServiceProtocolOnHA
Java HotSpot(TM) 64-Bit Server VM warning: ignoring option MaxPermSize=768m; support was removed
in 8.0
Running org.apache.hadoop.yarn.client.TestApplicationClientProtocolOnHA
Tests run: 17, Failures: 0, Errors: 0, Skipped: 0, Time elapsed: 120.111 sec - in org.apache.hadoop.yarn.client.TestApplicationClientProtocolOnHA
Java HotSpot(TM) 64-Bit Server VM warning: ignoring option MaxPermSize=768m; support was removed
in 8.0
Running org.apache.hadoop.yarn.client.TestRMFailover
Tests run: 5, Failures: 0, Errors: 0, Skipped: 0, Time elapsed: 42.216 sec - in org.apache.hadoop.yarn.client.TestRMFailover
Java HotSpot(TM) 64-Bit Server VM warning: ignoring option MaxPermSize=768m; support was removed
in 8.0
Running org.apache.hadoop.yarn.client.cli.TestYarnCLI
Tests run: 25, Failures: 0, Errors: 0, Skipped: 0, Time elapsed: 1.569 sec - in org.apache.hadoop.yarn.client.cli.TestYarnCLI
Java HotSpot(TM) 64-Bit Server VM warning: ignoring option MaxPermSize=768m; support was removed
in 8.0
Running org.apache.hadoop.yarn.client.cli.TestLogsCLI
Tests run: 5, Failures: 0, Errors: 0, Skipped: 0, Time elapsed: 1.047 sec - in org.apache.hadoop.yarn.client.cli.TestLogsCLI
Java HotSpot(TM) 64-Bit Server VM warning: ignoring option MaxPermSize=768m; support was removed
in 8.0
Running org.apache.hadoop.yarn.client.cli.TestRMAdminCLI
Tests run: 19, Failures: 0, Errors: 0, Skipped: 0, Time elapsed: 1.109 sec - in org.apache.hadoop.yarn.client.cli.TestRMAdminCLI
Java HotSpot(TM) 64-Bit Server VM warning: ignoring option MaxPermSize=768m; support was removed
in 8.0
Running org.apache.hadoop.yarn.client.TestResourceTrackerOnHA
Tests run: 1, Failures: 0, Errors: 0, Skipped: 0, Time elapsed: 8.134 sec - in org.apache.hadoop.yarn.client.TestResourceTrackerOnHA
Java HotSpot(TM) 64-Bit Server VM warning: ignoring option MaxPermSize=768m; support was removed
in 8.0
Running org.apache.hadoop.yarn.client.TestResourceManagerAdministrationProtocolPBClientImpl
Tests run: 7, Failures: 0, Errors: 0, Skipped: 0, Time elapsed: 2.621 sec - in org.apache.hadoop.yarn.client.TestResourceManagerAdministrationProtocolPBClientImpl
Java HotSpot(TM) 64-Bit Server VM warning: ignoring option MaxPermSize=768m; support was removed
in 8.0
Running org.apache.hadoop.yarn.client.TestGetGroups
Tests run: 6, Failures: 0, Errors: 0, Skipped: 0, Time elapsed: 3.72 sec - in org.apache.hadoop.yarn.client.TestGetGroups

Results :

Failed tests: 
  TestAMRMClient.testAMRMClientOnAMRMTokenRollOver:1007 null

Tests run: 150, Failures: 1, Errors: 0, Skipped: 0

[INFO] ------------------------------------------------------------------------
[INFO] Reactor Summary:
[INFO] 
[INFO] hadoop-yarn ....................................... SUCCESS [  2.871 s]
[INFO] hadoop-yarn-api ................................... SUCCESS [ 53.400 s]
[INFO] hadoop-yarn-common ................................ SUCCESS [02:11 min]
[INFO] hadoop-yarn-server ................................ SUCCESS [  0.051 s]
[INFO] hadoop-yarn-server-common ......................... SUCCESS [ 33.233 s]
[INFO] hadoop-yarn-server-nodemanager .................... SUCCESS [06:09 min]
[INFO] hadoop-yarn-server-web-proxy ...................... SUCCESS [ 14.554 s]
[INFO] hadoop-yarn-server-applicationhistoryservice ...... SUCCESS [02:54 min]
[INFO] hadoop-yarn-server-resourcemanager ................ SUCCESS [50:06 min]
[INFO] hadoop-yarn-server-tests .......................... SUCCESS [02:11 min]
[INFO] hadoop-yarn-client ................................ FAILURE [07:23 min]
[INFO] hadoop-yarn-server-sharedcachemanager ............. SKIPPED
[INFO] hadoop-yarn-applications .......................... SKIPPED
[INFO] hadoop-yarn-applications-distributedshell ......... SKIPPED
[INFO] hadoop-yarn-applications-unmanaged-am-launcher .... SKIPPED
[INFO] hadoop-yarn-site .................................. SKIPPED
[INFO] hadoop-yarn-registry .............................. SKIPPED
[INFO] hadoop-yarn-project ............................... SKIPPED
[INFO] ------------------------------------------------------------------------
[INFO] BUILD FAILURE
[INFO] ------------------------------------------------------------------------
[INFO] Total time: 01:12 h
[INFO] Finished at: 2015-01-19T11:44:38+00:00
[INFO] Final Memory: 79M/880M
[INFO] ------------------------------------------------------------------------
[ERROR] Failed to execute goal org.apache.maven.plugins:maven-surefire-plugin:2.17:test (default-test)
on project hadoop-yarn-client: There are test failures.
[ERROR] 
[ERROR] Please refer to <https://builds.apache.org/job/Hadoop-Yarn-trunk-Java8/ws/hadoop-yarn-project/hadoop-yarn/hadoop-yarn-client/target/surefire-reports>
for the individual test results.
[ERROR] -> [Help 1]
[ERROR] 
[ERROR] To see the full stack trace of the errors, re-run Maven with the -e switch.
[ERROR] Re-run Maven using the -X switch to enable full debug logging.
[ERROR] 
[ERROR] For more information about the errors and possible solutions, please read the following
articles:
[ERROR] [Help 1] http://cwiki.apache.org/confluence/display/MAVEN/MojoFailureException
[ERROR] 
[ERROR] After correcting the problems, you can resume the build with the command
[ERROR]   mvn <goals> -rf :hadoop-yarn-client
Build step 'Execute shell' marked build as failure
Archiving artifacts
Recording test results
Updating YARN-3070

Mime
View raw message