hadoop-yarn-dev mailing list archives

Site index · List index
Message view « Date » · « Thread »
Top « Date » · « Thread »
From Apache Jenkins Server <jenk...@builds.apache.org>
Subject Hadoop-Yarn-trunk-Java8 - Build # 67 - Still Failing
Date Thu, 08 Jan 2015 11:33:15 GMT
See https://builds.apache.org/job/Hadoop-Yarn-trunk-Java8/67/

###################################################################################
########################## LAST 60 LINES OF THE CONSOLE ###########################
[...truncated 4695 lines...]
Failed tests: 
  TestRMRestart.testRMRestartWaitForPreviousAMToFinish:591 expected:<4> but was:<3>

Tests run: 1001, Failures: 1, Errors: 0, Skipped: 1

[INFO] ------------------------------------------------------------------------
[INFO] Reactor Summary:
[INFO] 
[INFO] hadoop-yarn ....................................... SUCCESS [  2.758 s]
[INFO] hadoop-yarn-api ................................... SUCCESS [ 59.058 s]
[INFO] hadoop-yarn-common ................................ SUCCESS [02:19 min]
[INFO] hadoop-yarn-server ................................ SUCCESS [  0.049 s]
[INFO] hadoop-yarn-server-common ......................... SUCCESS [ 34.374 s]
[INFO] hadoop-yarn-server-nodemanager .................... SUCCESS [06:07 min]
[INFO] hadoop-yarn-server-web-proxy ...................... SUCCESS [ 14.342 s]
[INFO] hadoop-yarn-server-applicationhistoryservice ...... SUCCESS [02:50 min]
[INFO] hadoop-yarn-server-resourcemanager ................ FAILURE [47:49 min]
[INFO] hadoop-yarn-server-tests .......................... SKIPPED
[INFO] hadoop-yarn-client ................................ SKIPPED
[INFO] hadoop-yarn-server-sharedcachemanager ............. SKIPPED
[INFO] hadoop-yarn-applications .......................... SKIPPED
[INFO] hadoop-yarn-applications-distributedshell ......... SKIPPED
[INFO] hadoop-yarn-applications-unmanaged-am-launcher .... SKIPPED
[INFO] hadoop-yarn-site .................................. SKIPPED
[INFO] hadoop-yarn-registry .............................. SKIPPED
[INFO] hadoop-yarn-project ............................... SKIPPED
[INFO] ------------------------------------------------------------------------
[INFO] BUILD FAILURE
[INFO] ------------------------------------------------------------------------
[INFO] Total time: 01:00 h
[INFO] Finished at: 2015-01-08T11:32:58+00:00
[INFO] Final Memory: 73M/980M
[INFO] ------------------------------------------------------------------------
[ERROR] Failed to execute goal org.apache.maven.plugins:maven-surefire-plugin:2.17:test (default-test)
on project hadoop-yarn-server-resourcemanager: There are test failures.
[ERROR] 
[ERROR] Please refer to /home/jenkins/jenkins-slave/workspace/Hadoop-Yarn-trunk-Java8/hadoop-yarn-project/hadoop-yarn/hadoop-yarn-server/hadoop-yarn-server-resourcemanager/target/surefire-reports
for the individual test results.
[ERROR] -> [Help 1]
[ERROR] 
[ERROR] To see the full stack trace of the errors, re-run Maven with the -e switch.
[ERROR] Re-run Maven using the -X switch to enable full debug logging.
[ERROR] 
[ERROR] For more information about the errors and possible solutions, please read the following
articles:
[ERROR] [Help 1] http://cwiki.apache.org/confluence/display/MAVEN/MojoFailureException
[ERROR] 
[ERROR] After correcting the problems, you can resume the build with the command
[ERROR]   mvn <goals> -rf :hadoop-yarn-server-resourcemanager
Build step 'Execute shell' marked build as failure
Archiving artifacts
Recording test results
Updating YARN-3010
Updating HADOOP-11032
Updating HADOOP-11462
Updating YARN-2936
Updating YARN-2880
Updating HDFS-7561
Updating YARN-2230
Sending e-mails to: yarn-dev@hadoop.apache.org
Email was triggered for: Failure
Sending email for trigger: Failure



###################################################################################
############################## FAILED TESTS (if any) ##############################
1 tests failed.
REGRESSION:  org.apache.hadoop.yarn.server.resourcemanager.TestRMRestart.testRMRestartWaitForPreviousAMToFinish[1]

Error Message:
expected:<4> but was:<3>

Stack Trace:
java.lang.AssertionError: expected:<4> but was:<3>
	at org.junit.Assert.fail(Assert.java:88)
	at org.junit.Assert.failNotEquals(Assert.java:743)
	at org.junit.Assert.assertEquals(Assert.java:118)
	at org.junit.Assert.assertEquals(Assert.java:555)
	at org.junit.Assert.assertEquals(Assert.java:542)
	at org.apache.hadoop.yarn.server.resourcemanager.TestRMRestart.testRMRestartWaitForPreviousAMToFinish(TestRMRestart.java:591)



Mime
  • Unnamed multipart/mixed (inline, None, 0 bytes)
View raw message