hadoop-yarn-dev mailing list archives

Site index · List index
Message view « Date » · « Thread »
Top « Date » · « Thread »
From Apache Jenkins Server <jenk...@builds.apache.org>
Subject Failed: YARN-3195 PreCommit Build #6701
Date Mon, 23 Feb 2015 19:46:55 GMT
Jira: https://issues.apache.org/jira/browse/YARN-3195
Build: https://builds.apache.org/job/PreCommit-YARN-Build/6701/

###################################################################################
########################## LAST 60 LINES OF THE CONSOLE ###########################
[...truncated 3237 lines...]
{color:red}-1 overall{color}.  Here are the results of testing the latest attachment 
  http://issues.apache.org/jira/secure/attachment/12700221/YARN-3195.20150223-1.patch
  against trunk revision fe7a302.

    {color:green}+1 @author{color}.  The patch does not contain any @author tags.

    {color:green}+1 tests included{color}.  The patch appears to include 2 new or modified
test files.

    {color:green}+1 javac{color}.  The applied patch does not increase the total number of
javac compiler warnings.

    {color:green}+1 javadoc{color}.  There were no new javadoc warning messages.

    {color:green}+1 eclipse:eclipse{color}.  The patch built with eclipse:eclipse.

    {color:green}+1 findbugs{color}.  The patch does not introduce any new Findbugs (version
2.0.3) warnings.

    {color:green}+1 release audit{color}.  The applied patch does not increase the total number
of release audit warnings.

    {color:red}-1 core tests{color}.  The patch failed these unit tests in hadoop-yarn-project/hadoop-yarn/hadoop-yarn-client:

                  org.apache.hadoop.yarn.client.api.impl.TestAMRMClient

Test results: https://builds.apache.org/job/PreCommit-YARN-Build/6701//testReport/
Console output: https://builds.apache.org/job/PreCommit-YARN-Build/6701//console

This message is automatically generated.


======================================================================
======================================================================
    Adding comment to Jira.
======================================================================
======================================================================


Comment added.
3829120df32c87fb80d99ef9475f2b3be2a37afb logged out


======================================================================
======================================================================
    Finished build.
======================================================================
======================================================================


Build step 'Execute shell' marked build as failure
Archiving artifacts
Sending artifact delta relative to PreCommit-YARN-Build #6696
Archived 15 artifacts
Archive block size is 32768
Received 232 blocks and 1189122 bytes
Compression is 86.5%
Took 0.83 sec
[description-setter] Could not determine description.
Recording test results
Publish JUnit test result report is waiting for a checkpoint on PreCommit-YARN-Build #6700
Email was triggered for: Failure
Sending email for trigger: Failure



###################################################################################
############################## FAILED TESTS (if any) ##############################
1 tests failed.
FAILED:  org.apache.hadoop.yarn.client.api.impl.TestAMRMClient.testAMRMClientOnAMRMTokenRollOver

Error Message:
null

Stack Trace:
java.lang.AssertionError: null
	at org.junit.Assert.fail(Assert.java:86)
	at org.junit.Assert.assertTrue(Assert.java:41)
	at org.junit.Assert.assertTrue(Assert.java:52)
	at org.apache.hadoop.yarn.client.api.impl.TestAMRMClient.testAMRMClientOnAMRMTokenRollOver(TestAMRMClient.java:1046)



Mime
  • Unnamed multipart/mixed (inline, None, 0 bytes)
View raw message