hadoop-yarn-dev mailing list archives

Site index · List index
Message view « Date » · « Thread »
Top « Date » · « Thread »
From Apache Jenkins Server <jenk...@builds.apache.org>
Subject Failed: YARN-3021 PreCommit Build #6479
Date Sun, 01 Feb 2015 09:20:51 GMT
Jira: https://issues.apache.org/jira/browse/YARN-3021
Build: https://builds.apache.org/job/PreCommit-YARN-Build/6479/

###################################################################################
########################## LAST 60 LINES OF THE CONSOLE ###########################
[...truncated 4344 lines...]
  against trunk revision ffc75d6.

    {color:green}+1 @author{color}.  The patch does not contain any @author tags.

    {color:green}+1 tests included{color}.  The patch appears to include 2 new or modified
test files.

    {color:green}+1 javac{color}.  The applied patch does not increase the total number of
javac compiler warnings.

    {color:green}+1 javadoc{color}.  There were no new javadoc warning messages.

    {color:green}+1 eclipse:eclipse{color}.  The patch built with eclipse:eclipse.

    {color:red}-1 findbugs{color}.  The patch appears to introduce 13 new Findbugs (version
2.0.3) warnings.

        {color:red}-1 release audit{color}.  The applied patch generated 1 release audit warnings.

    {color:red}-1 core tests{color}.  The patch failed these unit tests in hadoop-mapreduce-project/hadoop-mapreduce-client/hadoop-mapreduce-client-core
hadoop-mapreduce-project/hadoop-mapreduce-client/hadoop-mapreduce-client-jobclient hadoop-yarn-project/hadoop-yarn/hadoop-yarn-api
hadoop-yarn-project/hadoop-yarn/hadoop-yarn-common hadoop-yarn-project/hadoop-yarn/hadoop-yarn-server/hadoop-yarn-server-resourcemanager:

                  org.apache.hadoop.mapreduce.TestLargeSort
                  org.apache.hadoop.conf.TestJobConf

Test results: https://builds.apache.org/job/PreCommit-YARN-Build/6479//testReport/
Release audit warnings: https://builds.apache.org/job/PreCommit-YARN-Build/6479//artifact/patchprocess/patchReleaseAuditProblems.txt
Findbugs warnings: https://builds.apache.org/job/PreCommit-YARN-Build/6479//artifact/patchprocess/newPatchFindbugsWarningshadoop-mapreduce-client-core.html
Console output: https://builds.apache.org/job/PreCommit-YARN-Build/6479//console

This message is automatically generated.


======================================================================
======================================================================
    Adding comment to Jira.
======================================================================
======================================================================


Comment added.
1d8ce6fad50245ca24436ad6a0ff706b89d6b8ff logged out


======================================================================
======================================================================
    Finished build.
======================================================================
======================================================================


Build step 'Execute shell' marked build as failure
Archiving artifacts
Sending artifact delta relative to PreCommit-YARN-Build #6454
Archived 36 artifacts
Archive block size is 32768
Received 134 blocks and 4981025 bytes
Compression is 46.9%
Took 1.3 sec
[description-setter] Could not determine description.
Recording test results
Email was triggered for: Failure
Sending email for trigger: Failure



###################################################################################
############################## FAILED TESTS (if any) ##############################
2 tests failed.
FAILED:  org.apache.hadoop.conf.TestJobConf.testNegativeValueForTaskVmem

Error Message:
expected:<1024> but was:<-1>

Stack Trace:
java.lang.AssertionError: expected:<1024> but was:<-1>
	at org.junit.Assert.fail(Assert.java:88)
	at org.junit.Assert.failNotEquals(Assert.java:743)
	at org.junit.Assert.assertEquals(Assert.java:118)
	at org.junit.Assert.assertEquals(Assert.java:555)
	at org.junit.Assert.assertEquals(Assert.java:542)
	at org.apache.hadoop.conf.TestJobConf.testNegativeValueForTaskVmem(TestJobConf.java:111)


FAILED:  org.apache.hadoop.mapreduce.TestLargeSort.testLargeSort

Error Message:
Large sort failed for 128 expected:<0> but was:<1>

Stack Trace:
java.lang.AssertionError: Large sort failed for 128 expected:<0> but was:<1>
	at org.junit.Assert.fail(Assert.java:88)
	at org.junit.Assert.failNotEquals(Assert.java:743)
	at org.junit.Assert.assertEquals(Assert.java:118)
	at org.junit.Assert.assertEquals(Assert.java:555)
	at org.apache.hadoop.mapreduce.TestLargeSort.testLargeSort(TestLargeSort.java:61)



Mime
  • Unnamed multipart/mixed (inline, None, 0 bytes)
View raw message