hadoop-yarn-dev mailing list archives

Site index · List index
Message view « Date » · « Thread »
Top « Date » · « Thread »
From Apache Jenkins Server <jenk...@builds.apache.org>
Subject Failed: YARN-3122 PreCommit Build #6637
Date Sat, 14 Feb 2015 04:46:33 GMT
Jira: https://issues.apache.org/jira/browse/YARN-3122
Build: https://builds.apache.org/job/PreCommit-YARN-Build/6637/

###################################################################################
########################## LAST 60 LINES OF THE CONSOLE ###########################
[...truncated 3668 lines...]

{color:red}-1 overall{color}.  Here are the results of testing the latest attachment 
  http://issues.apache.org/jira/secure/attachment/12698869/YARN-3122.001.patch
  against trunk revision 2efb234.

    {color:green}+1 @author{color}.  The patch does not contain any @author tags.

    {color:green}+1 tests included{color}.  The patch appears to include 3 new or modified
test files.

    {color:green}+1 javac{color}.  The applied patch does not increase the total number of
javac compiler warnings.

    {color:green}+1 javadoc{color}.  There were no new javadoc warning messages.

    {color:green}+1 eclipse:eclipse{color}.  The patch built with eclipse:eclipse.

    {color:green}+1 findbugs{color}.  The patch does not introduce any new Findbugs (version
2.0.3) warnings.

    {color:green}+1 release audit{color}.  The applied patch does not increase the total number
of release audit warnings.

    {color:red}-1 core tests{color}.  The patch failed these unit tests in hadoop-yarn-project/hadoop-yarn/hadoop-yarn-common
hadoop-yarn-project/hadoop-yarn/hadoop-yarn-server/hadoop-yarn-server-nodemanager:

                  org.apache.hadoop.yarn.util.TestProcfsBasedProcessTree

Test results: https://builds.apache.org/job/PreCommit-YARN-Build/6637//testReport/
Console output: https://builds.apache.org/job/PreCommit-YARN-Build/6637//console

This message is automatically generated.


======================================================================
======================================================================
    Adding comment to Jira.
======================================================================
======================================================================


Comment added.
a58574beea8176833dabf1ffc2ecdfab6d1be89f logged out


======================================================================
======================================================================
    Finished build.
======================================================================
======================================================================


Build step 'Execute shell' marked build as failure
Archiving artifacts
Sending artifact delta relative to PreCommit-YARN-Build #6636
Archived 20 artifacts
Archive block size is 32768
Received 48 blocks and 7665111 bytes
Compression is 17.0%
Took 1.8 sec
[description-setter] Could not determine description.
Recording test results
Email was triggered for: Failure
Sending email for trigger: Failure



###################################################################################
############################## FAILED TESTS (if any) ##############################
1 tests failed.
FAILED:  org.apache.hadoop.yarn.util.TestProcfsBasedProcessTree.testCpuAndMemoryForProcessTree

Error Message:
Percent CPU time is not correct expected 1.0 expected:<1.0> but was:<1.100000023841858>

Stack Trace:
java.lang.AssertionError: Percent CPU time is not correct expected 1.0 expected:<1.0>
but was:<1.100000023841858>
	at org.junit.Assert.fail(Assert.java:88)
	at org.junit.Assert.failNotEquals(Assert.java:743)
	at org.junit.Assert.assertEquals(Assert.java:494)
	at org.apache.hadoop.yarn.util.TestProcfsBasedProcessTree.testCpuAndMemoryForProcessTree(TestProcfsBasedProcessTree.java:492)



Mime
  • Unnamed multipart/mixed (inline, None, 0 bytes)
View raw message