hadoop-yarn-dev mailing list archives

Site index · List index
Message view « Date » · « Thread »
Top « Date » · « Thread »
From Apache Jenkins Server <jenk...@builds.apache.org>
Subject Failed: YARN-3094 PreCommit Build #6506
Date Wed, 04 Feb 2015 16:48:31 GMT
Jira: https://issues.apache.org/jira/browse/YARN-3094
Build: https://builds.apache.org/job/PreCommit-YARN-Build/6506/

###################################################################################
########################## LAST 60 LINES OF THE CONSOLE ###########################
[...truncated 3656 lines...]

{color:red}-1 overall{color}.  Here are the results of testing the latest attachment 
  http://issues.apache.org/jira/secure/attachment/12696477/YARN-3094.4.patch
  against trunk revision 42548f4.

    {color:green}+1 @author{color}.  The patch does not contain any @author tags.

    {color:green}+1 tests included{color}.  The patch appears to include 1 new or modified
test files.

    {color:green}+1 javac{color}.  The applied patch does not increase the total number of
javac compiler warnings.

    {color:green}+1 javadoc{color}.  There were no new javadoc warning messages.

    {color:green}+1 eclipse:eclipse{color}.  The patch built with eclipse:eclipse.

    {color:green}+1 findbugs{color}.  The patch does not introduce any new Findbugs (version
2.0.3) warnings.

    {color:green}+1 release audit{color}.  The applied patch does not increase the total number
of release audit warnings.

    {color:red}-1 core tests{color}.  The patch failed these unit tests in hadoop-yarn-project/hadoop-yarn/hadoop-yarn-common
hadoop-yarn-project/hadoop-yarn/hadoop-yarn-server/hadoop-yarn-server-resourcemanager:

                  org.apache.hadoop.yarn.server.resourcemanager.TestMoveApplication

Test results: https://builds.apache.org/job/PreCommit-YARN-Build/6506//testReport/
Console output: https://builds.apache.org/job/PreCommit-YARN-Build/6506//console

This message is automatically generated.


======================================================================
======================================================================
    Adding comment to Jira.
======================================================================
======================================================================


Comment added.
e520e5aaa4e7026031e0be82dcc9222a548b53d7 logged out


======================================================================
======================================================================
    Finished build.
======================================================================
======================================================================


Build step 'Execute shell' marked build as failure
Archiving artifacts
Sending artifact delta relative to PreCommit-YARN-Build #6493
Archived 20 artifacts
Archive block size is 32768
Received 29 blocks and 8342692 bytes
Compression is 10.2%
Took 1.8 sec
[description-setter] Could not determine description.
Recording test results
Email was triggered for: Failure
Sending email for trigger: Failure



###################################################################################
############################## FAILED TESTS (if any) ##############################
1 tests failed.
FAILED:  org.apache.hadoop.yarn.server.resourcemanager.TestMoveApplication.testMoveSuccessful

Error Message:
test timed out after 10000 milliseconds

Stack Trace:
java.lang.Exception: test timed out after 10000 milliseconds
	at java.lang.Thread.sleep(Native Method)
	at org.apache.hadoop.yarn.server.resourcemanager.MockRM.waitForState(MockRM.java:131)
	at org.apache.hadoop.yarn.server.resourcemanager.MockRM.submitApp(MockRM.java:422)
	at org.apache.hadoop.yarn.server.resourcemanager.MockRM.submitApp(MockRM.java:314)
	at org.apache.hadoop.yarn.server.resourcemanager.MockRM.submitApp(MockRM.java:306)
	at org.apache.hadoop.yarn.server.resourcemanager.MockRM.submitApp(MockRM.java:297)
	at org.apache.hadoop.yarn.server.resourcemanager.MockRM.submitApp(MockRM.java:290)
	at org.apache.hadoop.yarn.server.resourcemanager.MockRM.submitApp(MockRM.java:259)
	at org.apache.hadoop.yarn.server.resourcemanager.MockRM.submitApp(MockRM.java:247)
	at org.apache.hadoop.yarn.server.resourcemanager.MockRM.submitApp(MockRM.java:242)
	at org.apache.hadoop.yarn.server.resourcemanager.TestMoveApplication.testMoveSuccessful(TestMoveApplication.java:128)



Mime
  • Unnamed multipart/mixed (inline, None, 0 bytes)
View raw message