hadoop-yarn-dev mailing list archives

Site index · List index
Message view « Date » · « Thread »
Top « Date » · « Thread »
From Apache Jenkins Server <jenk...@builds.apache.org>
Subject Failed: YARN-2990 PreCommit Build #6500
Date Wed, 04 Feb 2015 00:23:14 GMT
Jira: https://issues.apache.org/jira/browse/YARN-2990
Build: https://builds.apache.org/job/PreCommit-YARN-Build/6500/

###################################################################################
########################## LAST 60 LINES OF THE CONSOLE ###########################
[...truncated 3438 lines...]

{color:red}-1 overall{color}.  Here are the results of testing the latest attachment 
  http://issues.apache.org/jira/secure/attachment/12696309/yarn-2990-2.patch
  against trunk revision bd69fb2.

    {color:green}+1 @author{color}.  The patch does not contain any @author tags.

    {color:green}+1 tests included{color}.  The patch appears to include 1 new or modified
test files.

    {color:green}+1 javac{color}.  The applied patch does not increase the total number of
javac compiler warnings.

    {color:green}+1 javadoc{color}.  There were no new javadoc warning messages.

    {color:green}+1 eclipse:eclipse{color}.  The patch built with eclipse:eclipse.

    {color:green}+1 findbugs{color}.  The patch does not introduce any new Findbugs (version
2.0.3) warnings.

    {color:green}+1 release audit{color}.  The applied patch does not increase the total number
of release audit warnings.

    {color:red}-1 core tests{color}.  The patch failed these unit tests in hadoop-yarn-project/hadoop-yarn/hadoop-yarn-server/hadoop-yarn-server-resourcemanager:

                  org.apache.hadoop.yarn.server.resourcemanager.TestRMRestart

Test results: https://builds.apache.org/job/PreCommit-YARN-Build/6500//testReport/
Console output: https://builds.apache.org/job/PreCommit-YARN-Build/6500//console

This message is automatically generated.


======================================================================
======================================================================
    Adding comment to Jira.
======================================================================
======================================================================


Comment added.
8897b97069a070d2aff7f7270729768f467c6fd5 logged out


======================================================================
======================================================================
    Finished build.
======================================================================
======================================================================


Build step 'Execute shell' marked build as failure
Archiving artifacts
Sending artifact delta relative to PreCommit-YARN-Build #6493
Archived 15 artifacts
Archive block size is 32768
Received 31 blocks and 7975635 bytes
Compression is 11.3%
Took 1.8 sec
Description set: MAPREDUCE-5800
Recording test results
Email was triggered for: Failure
Sending email for trigger: Failure



###################################################################################
############################## FAILED TESTS (if any) ##############################
1 tests failed.
FAILED:  org.apache.hadoop.yarn.server.resourcemanager.TestRMRestart.testRMRestartWaitForPreviousAMToFinish[0]

Error Message:
AppAttempt state is not correct (timedout) expected:<ALLOCATED> but was:<FAILED>

Stack Trace:
java.lang.AssertionError: AppAttempt state is not correct (timedout) expected:<ALLOCATED>
but was:<FAILED>
	at org.junit.Assert.fail(Assert.java:88)
	at org.junit.Assert.failNotEquals(Assert.java:743)
	at org.junit.Assert.assertEquals(Assert.java:118)
	at org.apache.hadoop.yarn.server.resourcemanager.MockAM.waitForState(MockAM.java:86)
	at org.apache.hadoop.yarn.server.resourcemanager.MockRM.sendAMLaunched(MockRM.java:495)
	at org.apache.hadoop.yarn.server.resourcemanager.TestRMRestart.launchAM(TestRMRestart.java:973)
	at org.apache.hadoop.yarn.server.resourcemanager.TestRMRestart.testRMRestartWaitForPreviousAMToFinish(TestRMRestart.java:555)



Mime
  • Unnamed multipart/mixed (inline, None, 0 bytes)
View raw message