hadoop-yarn-dev mailing list archives

Site index · List index
Message view « Date » · « Thread »
Top « Date » · « Thread »
From Apache Jenkins Server <jenk...@builds.apache.org>
Subject Failed: YARN-2820 PreCommit Build #6650
Date Tue, 17 Feb 2015 07:56:16 GMT
Jira: https://issues.apache.org/jira/browse/YARN-2820
Build: https://builds.apache.org/job/PreCommit-YARN-Build/6650/

###################################################################################
########################## LAST 60 LINES OF THE CONSOLE ###########################
[...truncated 3742 lines...]
  http://issues.apache.org/jira/secure/attachment/12699212/YARN-2820.001.patch
  against trunk revision 9729b24.

    {color:green}+1 @author{color}.  The patch does not contain any @author tags.

    {color:green}+1 tests included{color}.  The patch appears to include 1 new or modified
test files.

    {color:green}+1 javac{color}.  The applied patch does not increase the total number of
javac compiler warnings.

    {color:green}+1 javadoc{color}.  There were no new javadoc warning messages.

    {color:green}+1 eclipse:eclipse{color}.  The patch built with eclipse:eclipse.

    {color:red}-1 findbugs{color}.  The patch appears to introduce 5 new Findbugs (version
2.0.3) warnings.

    {color:green}+1 release audit{color}.  The applied patch does not increase the total number
of release audit warnings.

    {color:red}-1 core tests{color}.  The patch failed these unit tests in hadoop-yarn-project/hadoop-yarn/hadoop-yarn-api
hadoop-yarn-project/hadoop-yarn/hadoop-yarn-common hadoop-yarn-project/hadoop-yarn/hadoop-yarn-server/hadoop-yarn-server-resourcemanager:

                  org.apache.hadoop.yarn.server.resourcemanager.recovery.TestFSRMStateStore
                  org.apache.hadoop.yarn.server.resourcemanager.TestRMRestart

Test results: https://builds.apache.org/job/PreCommit-YARN-Build/6650//testReport/
Findbugs warnings: https://builds.apache.org/job/PreCommit-YARN-Build/6650//artifact/patchprocess/newPatchFindbugsWarningshadoop-yarn-server-resourcemanager.html
Console output: https://builds.apache.org/job/PreCommit-YARN-Build/6650//console

This message is automatically generated.


======================================================================
======================================================================
    Adding comment to Jira.
======================================================================
======================================================================


Comment added.
8e1a7385fe825e05f157b6884a1651522085c45c logged out


======================================================================
======================================================================
    Finished build.
======================================================================
======================================================================


Build step 'Execute shell' marked build as failure
Archiving artifacts
Sending artifact delta relative to PreCommit-YARN-Build #6642
Archived 25 artifacts
Archive block size is 32768
Received 45 blocks and 8231296 bytes
Compression is 15.2%
Took 2.1 sec
[description-setter] Could not determine description.
Recording test results
Email was triggered for: Failure
Sending email for trigger: Failure



###################################################################################
############################## FAILED TESTS (if any) ##############################
2 tests failed.
REGRESSION:  org.apache.hadoop.yarn.server.resourcemanager.TestRMRestart.testRMRestartGetApplicationList[1]

Error Message:

rMAppManager.logApplicationSummary(
    isA(org.apache.hadoop.yarn.api.records.ApplicationId)
);
Wanted 3 times:
-> at org.apache.hadoop.yarn.server.resourcemanager.TestRMRestart.testRMRestartGetApplicationList(TestRMRestart.java:969)
But was 2 times:
-> at org.apache.hadoop.yarn.server.resourcemanager.RMAppManager.handle(RMAppManager.java:66)


Stack Trace:
org.mockito.exceptions.verification.TooLittleActualInvocations: 
rMAppManager.logApplicationSummary(
    isA(org.apache.hadoop.yarn.api.records.ApplicationId)
);
Wanted 3 times:
-> at org.apache.hadoop.yarn.server.resourcemanager.TestRMRestart.testRMRestartGetApplicationList(TestRMRestart.java:969)
But was 2 times:
-> at org.apache.hadoop.yarn.server.resourcemanager.RMAppManager.handle(RMAppManager.java:66)

	at org.apache.hadoop.yarn.server.resourcemanager.TestRMRestart.testRMRestartGetApplicationList(TestRMRestart.java:969)


FAILED:  org.apache.hadoop.yarn.server.resourcemanager.recovery.TestFSRMStateStore.testFSRMStateStoreClientRetry

Error Message:
null

Stack Trace:
java.lang.AssertionError: null
	at org.junit.Assert.fail(Assert.java:86)
	at org.junit.Assert.assertTrue(Assert.java:41)
	at org.junit.Assert.assertFalse(Assert.java:64)
	at org.junit.Assert.assertFalse(Assert.java:74)
	at org.apache.hadoop.yarn.server.resourcemanager.recovery.TestFSRMStateStore.testFSRMStateStoreClientRetry(TestFSRMStateStore.java:294)



Mime
  • Unnamed multipart/mixed (inline, None, 0 bytes)
View raw message