hadoop-yarn-dev mailing list archives

Site index · List index
Message view « Date » · « Thread »
Top « Date » · « Thread »
From Apache Jenkins Server <jenk...@builds.apache.org>
Subject Failed: YARN-3149 PreCommit Build #6521
Date Thu, 05 Feb 2015 20:17:50 GMT
Jira: https://issues.apache.org/jira/browse/YARN-3149
Build: https://builds.apache.org/job/PreCommit-YARN-Build/6521/

###################################################################################
########################## LAST 60 LINES OF THE CONSOLE ###########################
[...truncated 3501 lines...]

    {color:red}-1 tests included{color}.  The patch doesn't appear to include any new or modified
tests.
                        Please justify why no new tests are needed for this patch.
                        Also please list what manual steps were performed to verify this patch.

      {color:red}-1 javac{color}.  The applied patch generated 1150 javac compiler warnings
(more than the trunk's current 205 warnings).

    {color:red}-1 javadoc{color}.  The javadoc tool appears to have generated 48 warning messages.
        See https://builds.apache.org/job/PreCommit-YARN-Build/6521//artifact/patchprocess/diffJavadocWarnings.txt
for details.

    {color:green}+1 eclipse:eclipse{color}.  The patch built with eclipse:eclipse.

    {color:green}+1 findbugs{color}.  The patch does not introduce any new Findbugs (version
2.0.3) warnings.

    {color:green}+1 release audit{color}.  The applied patch does not increase the total number
of release audit warnings.

    {color:red}-1 core tests{color}.  The patch failed these unit tests in hadoop-yarn-project/hadoop-yarn/hadoop-yarn-server/hadoop-yarn-server-resourcemanager:

                  org.apache.hadoop.yarn.server.resourcemanager.TestApplicationACLs
                  org.apache.hadoop.yarn.server.resourcemanager.TestWorkPreservingRMRestart
                  org.apache.hadoop.yarn.server.resourcemanager.recovery.TestFSRMStateStore

Test results: https://builds.apache.org/job/PreCommit-YARN-Build/6521//testReport/
Javac warnings: https://builds.apache.org/job/PreCommit-YARN-Build/6521//artifact/patchprocess/diffJavacWarnings.txt
Console output: https://builds.apache.org/job/PreCommit-YARN-Build/6521//console

This message is automatically generated.


======================================================================
======================================================================
    Adding comment to Jira.
======================================================================
======================================================================


Comment added.
ca32e76db0f5d0ab706b7887b7004ccf7c2bd0b5 logged out


======================================================================
======================================================================
    Finished build.
======================================================================
======================================================================


Build step 'Execute shell' marked build as failure
Archiving artifacts
Sending artifact delta relative to PreCommit-YARN-Build #6519
Archived 16 artifacts
Archive block size is 32768
Received 1 blocks and 9423502 bytes
Compression is 0.3%
Took 2.7 sec
[description-setter] Could not determine description.
Recording test results
Email was triggered for: Failure
Sending email for trigger: Failure



###################################################################################
############################## FAILED TESTS (if any) ##############################
34 tests failed.
FAILED:  org.apache.hadoop.yarn.server.resourcemanager.TestApplicationACLs.org.apache.hadoop.yarn.server.resourcemanager.TestApplicationACLs

Error Message:
ResourceManager failed to start. Final state is STOPPED

Stack Trace:
java.io.IOException: ResourceManager failed to start. Final state is STOPPED
	at org.apache.hadoop.yarn.server.resourcemanager.TestApplicationACLs.setup(TestApplicationACLs.java:145)


FAILED:  org.apache.hadoop.yarn.server.resourcemanager.TestWorkPreservingRMRestart.testCapacitySchedulerRecovery[0]

Error Message:
org/apache/hadoop/yarn/util/resource/DominantResourceCalculator

Stack Trace:
java.lang.NoClassDefFoundError: org/apache/hadoop/yarn/util/resource/DominantResourceCalculator
	at java.net.URLClassLoader$1.run(URLClassLoader.java:366)
	at java.net.URLClassLoader$1.run(URLClassLoader.java:355)
	at java.security.AccessController.doPrivileged(Native Method)
	at java.net.URLClassLoader.findClass(URLClassLoader.java:354)
	at java.lang.ClassLoader.loadClass(ClassLoader.java:425)
	at sun.misc.Launcher$AppClassLoader.loadClass(Launcher.java:308)
	at java.lang.ClassLoader.loadClass(ClassLoader.java:358)
	at org.apache.hadoop.yarn.server.resourcemanager.TestWorkPreservingRMRestart.testCapacitySchedulerRecovery(TestWorkPreservingRMRestart.java:475)


FAILED:  org.apache.hadoop.yarn.server.resourcemanager.TestWorkPreservingRMRestart.testAppReregisterOnRMWorkPreservingRestart[0]

Error Message:
org/apache/hadoop/yarn/state/SingleArcTransition

Stack Trace:
java.lang.NoClassDefFoundError: org/apache/hadoop/yarn/state/SingleArcTransition
	at java.net.URLClassLoader$1.run(URLClassLoader.java:366)
	at java.net.URLClassLoader$1.run(URLClassLoader.java:355)
	at java.security.AccessController.doPrivileged(Native Method)
	at java.net.URLClassLoader.findClass(URLClassLoader.java:354)
	at java.lang.ClassLoader.loadClass(ClassLoader.java:425)
	at sun.misc.Launcher$AppClassLoader.loadClass(Launcher.java:308)
	at java.lang.ClassLoader.loadClass(ClassLoader.java:358)
	at org.apache.hadoop.yarn.server.resourcemanager.TestWorkPreservingRMRestart.testAppReregisterOnRMWorkPreservingRestart(TestWorkPreservingRMRestart.java:741)


FAILED:  org.apache.hadoop.yarn.server.resourcemanager.TestWorkPreservingRMRestart.testCapacitySchedulerQueueRemovedRecovery[0]

Error Message:
Unexpected exception, expected<org.apache.hadoop.yarn.server.resourcemanager.scheduler.QueueNotFoundException>
but was<java.lang.NoClassDefFoundError>

Stack Trace:
java.lang.Exception: Unexpected exception, expected<org.apache.hadoop.yarn.server.resourcemanager.scheduler.QueueNotFoundException>
but was<java.lang.NoClassDefFoundError>
	at org.apache.hadoop.yarn.server.resourcemanager.TestWorkPreservingRMRestart.testCapacitySchedulerQueueRemovedRecovery(TestWorkPreservingRMRestart.java:594)


FAILED:  org.apache.hadoop.yarn.server.resourcemanager.TestWorkPreservingRMRestart.testAMfailedBetweenRMRestart[0]

Error Message:
org/apache/hadoop/yarn/state/SingleArcTransition

Stack Trace:
java.lang.NoClassDefFoundError: org/apache/hadoop/yarn/state/SingleArcTransition
	at java.net.URLClassLoader$1.run(URLClassLoader.java:366)
	at java.net.URLClassLoader$1.run(URLClassLoader.java:355)
	at java.security.AccessController.doPrivileged(Native Method)
	at java.net.URLClassLoader.findClass(URLClassLoader.java:354)
	at java.lang.ClassLoader.loadClass(ClassLoader.java:425)
	at sun.misc.Launcher$AppClassLoader.loadClass(Launcher.java:308)
	at java.lang.ClassLoader.loadClass(ClassLoader.java:358)
	at org.apache.hadoop.yarn.server.resourcemanager.TestWorkPreservingRMRestart.testAMfailedBetweenRMRestart(TestWorkPreservingRMRestart.java:647)


FAILED:  org.apache.hadoop.yarn.server.resourcemanager.TestWorkPreservingRMRestart.testRetriedFinishApplicationMasterRequest[0]

Error Message:
org/apache/hadoop/yarn/state/SingleArcTransition

Stack Trace:
java.lang.NoClassDefFoundError: org/apache/hadoop/yarn/state/SingleArcTransition
	at java.net.URLClassLoader$1.run(URLClassLoader.java:366)
	at java.net.URLClassLoader$1.run(URLClassLoader.java:355)
	at java.security.AccessController.doPrivileged(Native Method)
	at java.net.URLClassLoader.findClass(URLClassLoader.java:354)
	at java.lang.ClassLoader.loadClass(ClassLoader.java:425)
	at sun.misc.Launcher$AppClassLoader.loadClass(Launcher.java:308)
	at java.lang.ClassLoader.loadClass(ClassLoader.java:358)
	at org.apache.hadoop.yarn.server.resourcemanager.TestWorkPreservingRMRestart.testRetriedFinishApplicationMasterRequest(TestWorkPreservingRMRestart.java:996)


FAILED:  org.apache.hadoop.yarn.server.resourcemanager.TestWorkPreservingRMRestart.testContainersNotRecoveredForCompletedApps[0]

Error Message:
org/apache/hadoop/yarn/state/SingleArcTransition

Stack Trace:
java.lang.NoClassDefFoundError: org/apache/hadoop/yarn/state/SingleArcTransition
	at java.net.URLClassLoader$1.run(URLClassLoader.java:366)
	at java.net.URLClassLoader$1.run(URLClassLoader.java:355)
	at java.security.AccessController.doPrivileged(Native Method)
	at java.net.URLClassLoader.findClass(URLClassLoader.java:354)
	at java.lang.ClassLoader.loadClass(ClassLoader.java:425)
	at sun.misc.Launcher$AppClassLoader.loadClass(Launcher.java:308)
	at java.lang.ClassLoader.loadClass(ClassLoader.java:358)
	at org.apache.hadoop.yarn.server.resourcemanager.TestWorkPreservingRMRestart.testContainersNotRecoveredForCompletedApps(TestWorkPreservingRMRestart.java:702)


FAILED:  org.apache.hadoop.yarn.server.resourcemanager.TestWorkPreservingRMRestart.testRecoverSchedulerAppAndAttemptSynchronously[0]

Error Message:
org/apache/hadoop/yarn/state/SingleArcTransition

Stack Trace:
java.lang.NoClassDefFoundError: org/apache/hadoop/yarn/state/SingleArcTransition
	at java.net.URLClassLoader$1.run(URLClassLoader.java:366)
	at java.net.URLClassLoader$1.run(URLClassLoader.java:355)
	at java.security.AccessController.doPrivileged(Native Method)
	at java.net.URLClassLoader.findClass(URLClassLoader.java:354)
	at java.lang.ClassLoader.loadClass(ClassLoader.java:425)
	at sun.misc.Launcher$AppClassLoader.loadClass(Launcher.java:308)
	at java.lang.ClassLoader.loadClass(ClassLoader.java:358)
	at org.apache.hadoop.yarn.server.resourcemanager.TestWorkPreservingRMRestart.testRecoverSchedulerAppAndAttemptSynchronously(TestWorkPreservingRMRestart.java:811)


FAILED:  org.apache.hadoop.yarn.server.resourcemanager.TestWorkPreservingRMRestart.testReleasedContainerNotRecovered[0]

Error Message:
org/apache/hadoop/yarn/state/SingleArcTransition

Stack Trace:
java.lang.NoClassDefFoundError: org/apache/hadoop/yarn/state/SingleArcTransition
	at java.net.URLClassLoader$1.run(URLClassLoader.java:366)
	at java.net.URLClassLoader$1.run(URLClassLoader.java:355)
	at java.security.AccessController.doPrivileged(Native Method)
	at java.net.URLClassLoader.findClass(URLClassLoader.java:354)
	at java.lang.ClassLoader.loadClass(ClassLoader.java:425)
	at sun.misc.Launcher$AppClassLoader.loadClass(Launcher.java:308)
	at java.lang.ClassLoader.loadClass(ClassLoader.java:358)
	at org.apache.hadoop.yarn.server.resourcemanager.TestWorkPreservingRMRestart.testReleasedContainerNotRecovered(TestWorkPreservingRMRestart.java:844)


FAILED:  org.apache.hadoop.yarn.server.resourcemanager.TestWorkPreservingRMRestart.testAppFailedToRenewTokenOnRecovery[0]

Error Message:
org/apache/hadoop/yarn/state/SingleArcTransition

Stack Trace:
java.lang.NoClassDefFoundError: org/apache/hadoop/yarn/state/SingleArcTransition
	at java.net.URLClassLoader$1.run(URLClassLoader.java:366)
	at java.net.URLClassLoader$1.run(URLClassLoader.java:355)
	at java.security.AccessController.doPrivileged(Native Method)
	at java.net.URLClassLoader.findClass(URLClassLoader.java:354)
	at java.lang.ClassLoader.loadClass(ClassLoader.java:425)
	at sun.misc.Launcher$AppClassLoader.loadClass(Launcher.java:308)
	at java.lang.ClassLoader.loadClass(ClassLoader.java:358)
	at org.apache.hadoop.yarn.server.resourcemanager.TestWorkPreservingRMRestart.testAppFailedToRenewTokenOnRecovery(TestWorkPreservingRMRestart.java:1033)


FAILED:  org.apache.hadoop.yarn.server.resourcemanager.TestWorkPreservingRMRestart.testNewContainersNotAllocatedDuringSchedulerRecovery[0]

Error Message:
org/apache/hadoop/yarn/state/SingleArcTransition

Stack Trace:
java.lang.NoClassDefFoundError: org/apache/hadoop/yarn/state/SingleArcTransition
	at java.net.URLClassLoader$1.run(URLClassLoader.java:366)
	at java.net.URLClassLoader$1.run(URLClassLoader.java:355)
	at java.security.AccessController.doPrivileged(Native Method)
	at java.net.URLClassLoader.findClass(URLClassLoader.java:354)
	at java.lang.ClassLoader.loadClass(ClassLoader.java:425)
	at sun.misc.Launcher$AppClassLoader.loadClass(Launcher.java:308)
	at java.lang.ClassLoader.loadClass(ClassLoader.java:358)
	at org.apache.hadoop.yarn.server.resourcemanager.TestWorkPreservingRMRestart.testNewContainersNotAllocatedDuringSchedulerRecovery(TestWorkPreservingRMRestart.java:942)


FAILED:  org.apache.hadoop.yarn.server.resourcemanager.TestWorkPreservingRMRestart.testSchedulerRecovery[0]

Error Message:
org/apache/hadoop/yarn/util/resource/DominantResourceCalculator

Stack Trace:
java.lang.NoClassDefFoundError: org/apache/hadoop/yarn/util/resource/DominantResourceCalculator
	at org.apache.hadoop.yarn.server.resourcemanager.TestWorkPreservingRMRestart.testSchedulerRecovery(TestWorkPreservingRMRestart.java:153)


FAILED:  org.apache.hadoop.yarn.server.resourcemanager.TestWorkPreservingRMRestart.testAMContainerStatusWithRMRestart[0]

Error Message:
org/apache/hadoop/yarn/state/SingleArcTransition

Stack Trace:
java.lang.NoClassDefFoundError: org/apache/hadoop/yarn/state/SingleArcTransition
	at java.net.URLClassLoader$1.run(URLClassLoader.java:366)
	at java.net.URLClassLoader$1.run(URLClassLoader.java:355)
	at java.security.AccessController.doPrivileged(Native Method)
	at java.net.URLClassLoader.findClass(URLClassLoader.java:354)
	at java.lang.ClassLoader.loadClass(ClassLoader.java:425)
	at sun.misc.Launcher$AppClassLoader.loadClass(Launcher.java:308)
	at java.lang.ClassLoader.loadClass(ClassLoader.java:358)
	at org.apache.hadoop.yarn.server.resourcemanager.TestWorkPreservingRMRestart.testAMContainerStatusWithRMRestart(TestWorkPreservingRMRestart.java:774)


FAILED:  org.apache.hadoop.yarn.server.resourcemanager.TestWorkPreservingRMRestart.testAppReregisterOnRMWorkPreservingRestart[1]

Error Message:
org/apache/hadoop/yarn/state/SingleArcTransition

Stack Trace:
java.lang.NoClassDefFoundError: org/apache/hadoop/yarn/state/SingleArcTransition
	at java.net.URLClassLoader$1.run(URLClassLoader.java:366)
	at java.net.URLClassLoader$1.run(URLClassLoader.java:355)
	at java.security.AccessController.doPrivileged(Native Method)
	at java.net.URLClassLoader.findClass(URLClassLoader.java:354)
	at java.lang.ClassLoader.loadClass(ClassLoader.java:425)
	at sun.misc.Launcher$AppClassLoader.loadClass(Launcher.java:308)
	at java.lang.ClassLoader.loadClass(ClassLoader.java:358)
	at org.apache.hadoop.yarn.server.resourcemanager.TestWorkPreservingRMRestart.testAppReregisterOnRMWorkPreservingRestart(TestWorkPreservingRMRestart.java:741)


FAILED:  org.apache.hadoop.yarn.server.resourcemanager.TestWorkPreservingRMRestart.testAMfailedBetweenRMRestart[1]

Error Message:
org/apache/hadoop/yarn/state/SingleArcTransition

Stack Trace:
java.lang.NoClassDefFoundError: org/apache/hadoop/yarn/state/SingleArcTransition
	at java.net.URLClassLoader$1.run(URLClassLoader.java:366)
	at java.net.URLClassLoader$1.run(URLClassLoader.java:355)
	at java.security.AccessController.doPrivileged(Native Method)
	at java.net.URLClassLoader.findClass(URLClassLoader.java:354)
	at java.lang.ClassLoader.loadClass(ClassLoader.java:425)
	at sun.misc.Launcher$AppClassLoader.loadClass(Launcher.java:308)
	at java.lang.ClassLoader.loadClass(ClassLoader.java:358)
	at org.apache.hadoop.yarn.server.resourcemanager.TestWorkPreservingRMRestart.testAMfailedBetweenRMRestart(TestWorkPreservingRMRestart.java:647)


FAILED:  org.apache.hadoop.yarn.server.resourcemanager.TestWorkPreservingRMRestart.testRetriedFinishApplicationMasterRequest[1]

Error Message:
org/apache/hadoop/yarn/state/SingleArcTransition

Stack Trace:
java.lang.NoClassDefFoundError: org/apache/hadoop/yarn/state/SingleArcTransition
	at java.net.URLClassLoader$1.run(URLClassLoader.java:366)
	at java.net.URLClassLoader$1.run(URLClassLoader.java:355)
	at java.security.AccessController.doPrivileged(Native Method)
	at java.net.URLClassLoader.findClass(URLClassLoader.java:354)
	at java.lang.ClassLoader.loadClass(ClassLoader.java:425)
	at sun.misc.Launcher$AppClassLoader.loadClass(Launcher.java:308)
	at java.lang.ClassLoader.loadClass(ClassLoader.java:358)
	at org.apache.hadoop.yarn.server.resourcemanager.TestWorkPreservingRMRestart.testRetriedFinishApplicationMasterRequest(TestWorkPreservingRMRestart.java:996)


FAILED:  org.apache.hadoop.yarn.server.resourcemanager.TestWorkPreservingRMRestart.testContainersNotRecoveredForCompletedApps[1]

Error Message:
org/apache/hadoop/yarn/state/SingleArcTransition

Stack Trace:
java.lang.NoClassDefFoundError: org/apache/hadoop/yarn/state/SingleArcTransition
	at java.net.URLClassLoader$1.run(URLClassLoader.java:366)
	at java.net.URLClassLoader$1.run(URLClassLoader.java:355)
	at java.security.AccessController.doPrivileged(Native Method)
	at java.net.URLClassLoader.findClass(URLClassLoader.java:354)
	at java.lang.ClassLoader.loadClass(ClassLoader.java:425)
	at sun.misc.Launcher$AppClassLoader.loadClass(Launcher.java:308)
	at java.lang.ClassLoader.loadClass(ClassLoader.java:358)
	at org.apache.hadoop.yarn.server.resourcemanager.TestWorkPreservingRMRestart.testContainersNotRecoveredForCompletedApps(TestWorkPreservingRMRestart.java:702)


FAILED:  org.apache.hadoop.yarn.server.resourcemanager.TestWorkPreservingRMRestart.testRecoverSchedulerAppAndAttemptSynchronously[1]

Error Message:
org/apache/hadoop/yarn/state/SingleArcTransition

Stack Trace:
java.lang.NoClassDefFoundError: org/apache/hadoop/yarn/state/SingleArcTransition
	at java.net.URLClassLoader$1.run(URLClassLoader.java:366)
	at java.net.URLClassLoader$1.run(URLClassLoader.java:355)
	at java.security.AccessController.doPrivileged(Native Method)
	at java.net.URLClassLoader.findClass(URLClassLoader.java:354)
	at java.lang.ClassLoader.loadClass(ClassLoader.java:425)
	at sun.misc.Launcher$AppClassLoader.loadClass(Launcher.java:308)
	at java.lang.ClassLoader.loadClass(ClassLoader.java:358)
	at org.apache.hadoop.yarn.server.resourcemanager.TestWorkPreservingRMRestart.testRecoverSchedulerAppAndAttemptSynchronously(TestWorkPreservingRMRestart.java:811)


FAILED:  org.apache.hadoop.yarn.server.resourcemanager.TestWorkPreservingRMRestart.testReleasedContainerNotRecovered[1]

Error Message:
org/apache/hadoop/yarn/state/SingleArcTransition

Stack Trace:
java.lang.NoClassDefFoundError: org/apache/hadoop/yarn/state/SingleArcTransition
	at java.net.URLClassLoader$1.run(URLClassLoader.java:366)
	at java.net.URLClassLoader$1.run(URLClassLoader.java:355)
	at java.security.AccessController.doPrivileged(Native Method)
	at java.net.URLClassLoader.findClass(URLClassLoader.java:354)
	at java.lang.ClassLoader.loadClass(ClassLoader.java:425)
	at sun.misc.Launcher$AppClassLoader.loadClass(Launcher.java:308)
	at java.lang.ClassLoader.loadClass(ClassLoader.java:358)
	at org.apache.hadoop.yarn.server.resourcemanager.TestWorkPreservingRMRestart.testReleasedContainerNotRecovered(TestWorkPreservingRMRestart.java:844)


FAILED:  org.apache.hadoop.yarn.server.resourcemanager.TestWorkPreservingRMRestart.testAppFailedToRenewTokenOnRecovery[1]

Error Message:
org/apache/hadoop/yarn/state/SingleArcTransition

Stack Trace:
java.lang.NoClassDefFoundError: org/apache/hadoop/yarn/state/SingleArcTransition
	at java.net.URLClassLoader$1.run(URLClassLoader.java:366)
	at java.net.URLClassLoader$1.run(URLClassLoader.java:355)
	at java.security.AccessController.doPrivileged(Native Method)
	at java.net.URLClassLoader.findClass(URLClassLoader.java:354)
	at java.lang.ClassLoader.loadClass(ClassLoader.java:425)
	at sun.misc.Launcher$AppClassLoader.loadClass(Launcher.java:308)
	at java.lang.ClassLoader.loadClass(ClassLoader.java:358)
	at org.apache.hadoop.yarn.server.resourcemanager.TestWorkPreservingRMRestart.testAppFailedToRenewTokenOnRecovery(TestWorkPreservingRMRestart.java:1033)


FAILED:  org.apache.hadoop.yarn.server.resourcemanager.TestWorkPreservingRMRestart.testNewContainersNotAllocatedDuringSchedulerRecovery[1]

Error Message:
org/apache/hadoop/yarn/state/SingleArcTransition

Stack Trace:
java.lang.NoClassDefFoundError: org/apache/hadoop/yarn/state/SingleArcTransition
	at java.net.URLClassLoader$1.run(URLClassLoader.java:366)
	at java.net.URLClassLoader$1.run(URLClassLoader.java:355)
	at java.security.AccessController.doPrivileged(Native Method)
	at java.net.URLClassLoader.findClass(URLClassLoader.java:354)
	at java.lang.ClassLoader.loadClass(ClassLoader.java:425)
	at sun.misc.Launcher$AppClassLoader.loadClass(Launcher.java:308)
	at java.lang.ClassLoader.loadClass(ClassLoader.java:358)
	at org.apache.hadoop.yarn.server.resourcemanager.TestWorkPreservingRMRestart.testNewContainersNotAllocatedDuringSchedulerRecovery(TestWorkPreservingRMRestart.java:942)


FAILED:  org.apache.hadoop.yarn.server.resourcemanager.TestWorkPreservingRMRestart.testSchedulerRecovery[1]

Error Message:
org/apache/hadoop/yarn/util/resource/DominantResourceCalculator

Stack Trace:
java.lang.NoClassDefFoundError: org/apache/hadoop/yarn/util/resource/DominantResourceCalculator
	at org.apache.hadoop.yarn.server.resourcemanager.TestWorkPreservingRMRestart.testSchedulerRecovery(TestWorkPreservingRMRestart.java:153)


FAILED:  org.apache.hadoop.yarn.server.resourcemanager.TestWorkPreservingRMRestart.testAMContainerStatusWithRMRestart[1]

Error Message:
org/apache/hadoop/yarn/state/SingleArcTransition

Stack Trace:
java.lang.NoClassDefFoundError: org/apache/hadoop/yarn/state/SingleArcTransition
	at java.net.URLClassLoader$1.run(URLClassLoader.java:366)
	at java.net.URLClassLoader$1.run(URLClassLoader.java:355)
	at java.security.AccessController.doPrivileged(Native Method)
	at java.net.URLClassLoader.findClass(URLClassLoader.java:354)
	at java.lang.ClassLoader.loadClass(ClassLoader.java:425)
	at sun.misc.Launcher$AppClassLoader.loadClass(Launcher.java:308)
	at java.lang.ClassLoader.loadClass(ClassLoader.java:358)
	at org.apache.hadoop.yarn.server.resourcemanager.TestWorkPreservingRMRestart.testAMContainerStatusWithRMRestart(TestWorkPreservingRMRestart.java:774)


FAILED:  org.apache.hadoop.yarn.server.resourcemanager.TestWorkPreservingRMRestart.testAppReregisterOnRMWorkPreservingRestart[2]

Error Message:
org/apache/hadoop/yarn/state/SingleArcTransition

Stack Trace:
java.lang.NoClassDefFoundError: org/apache/hadoop/yarn/state/SingleArcTransition
	at java.net.URLClassLoader$1.run(URLClassLoader.java:366)
	at java.net.URLClassLoader$1.run(URLClassLoader.java:355)
	at java.security.AccessController.doPrivileged(Native Method)
	at java.net.URLClassLoader.findClass(URLClassLoader.java:354)
	at java.lang.ClassLoader.loadClass(ClassLoader.java:425)
	at sun.misc.Launcher$AppClassLoader.loadClass(Launcher.java:308)
	at java.lang.ClassLoader.loadClass(ClassLoader.java:358)
	at org.apache.hadoop.yarn.server.resourcemanager.TestWorkPreservingRMRestart.testAppReregisterOnRMWorkPreservingRestart(TestWorkPreservingRMRestart.java:741)


FAILED:  org.apache.hadoop.yarn.server.resourcemanager.TestWorkPreservingRMRestart.testAMfailedBetweenRMRestart[2]

Error Message:
org/apache/hadoop/yarn/state/SingleArcTransition

Stack Trace:
java.lang.NoClassDefFoundError: org/apache/hadoop/yarn/state/SingleArcTransition
	at java.net.URLClassLoader$1.run(URLClassLoader.java:366)
	at java.net.URLClassLoader$1.run(URLClassLoader.java:355)
	at java.security.AccessController.doPrivileged(Native Method)
	at java.net.URLClassLoader.findClass(URLClassLoader.java:354)
	at java.lang.ClassLoader.loadClass(ClassLoader.java:425)
	at sun.misc.Launcher$AppClassLoader.loadClass(Launcher.java:308)
	at java.lang.ClassLoader.loadClass(ClassLoader.java:358)
	at org.apache.hadoop.yarn.server.resourcemanager.TestWorkPreservingRMRestart.testAMfailedBetweenRMRestart(TestWorkPreservingRMRestart.java:647)


FAILED:  org.apache.hadoop.yarn.server.resourcemanager.TestWorkPreservingRMRestart.testRetriedFinishApplicationMasterRequest[2]

Error Message:
org/apache/hadoop/yarn/state/SingleArcTransition

Stack Trace:
java.lang.NoClassDefFoundError: org/apache/hadoop/yarn/state/SingleArcTransition
	at java.net.URLClassLoader$1.run(URLClassLoader.java:366)
	at java.net.URLClassLoader$1.run(URLClassLoader.java:355)
	at java.security.AccessController.doPrivileged(Native Method)
	at java.net.URLClassLoader.findClass(URLClassLoader.java:354)
	at java.lang.ClassLoader.loadClass(ClassLoader.java:425)
	at sun.misc.Launcher$AppClassLoader.loadClass(Launcher.java:308)
	at java.lang.ClassLoader.loadClass(ClassLoader.java:358)
	at org.apache.hadoop.yarn.server.resourcemanager.TestWorkPreservingRMRestart.testRetriedFinishApplicationMasterRequest(TestWorkPreservingRMRestart.java:996)


FAILED:  org.apache.hadoop.yarn.server.resourcemanager.TestWorkPreservingRMRestart.testContainersNotRecoveredForCompletedApps[2]

Error Message:
org/apache/hadoop/yarn/state/SingleArcTransition

Stack Trace:
java.lang.NoClassDefFoundError: org/apache/hadoop/yarn/state/SingleArcTransition
	at java.net.URLClassLoader$1.run(URLClassLoader.java:366)
	at java.net.URLClassLoader$1.run(URLClassLoader.java:355)
	at java.security.AccessController.doPrivileged(Native Method)
	at java.net.URLClassLoader.findClass(URLClassLoader.java:354)
	at java.lang.ClassLoader.loadClass(ClassLoader.java:425)
	at sun.misc.Launcher$AppClassLoader.loadClass(Launcher.java:308)
	at java.lang.ClassLoader.loadClass(ClassLoader.java:358)
	at org.apache.hadoop.yarn.server.resourcemanager.TestWorkPreservingRMRestart.testContainersNotRecoveredForCompletedApps(TestWorkPreservingRMRestart.java:702)


FAILED:  org.apache.hadoop.yarn.server.resourcemanager.TestWorkPreservingRMRestart.testRecoverSchedulerAppAndAttemptSynchronously[2]

Error Message:
org/apache/hadoop/yarn/state/SingleArcTransition

Stack Trace:
java.lang.NoClassDefFoundError: org/apache/hadoop/yarn/state/SingleArcTransition
	at java.net.URLClassLoader$1.run(URLClassLoader.java:366)
	at java.net.URLClassLoader$1.run(URLClassLoader.java:355)
	at java.security.AccessController.doPrivileged(Native Method)
	at java.net.URLClassLoader.findClass(URLClassLoader.java:354)
	at java.lang.ClassLoader.loadClass(ClassLoader.java:425)
	at sun.misc.Launcher$AppClassLoader.loadClass(Launcher.java:308)
	at java.lang.ClassLoader.loadClass(ClassLoader.java:358)
	at org.apache.hadoop.yarn.server.resourcemanager.TestWorkPreservingRMRestart.testRecoverSchedulerAppAndAttemptSynchronously(TestWorkPreservingRMRestart.java:811)


FAILED:  org.apache.hadoop.yarn.server.resourcemanager.TestWorkPreservingRMRestart.testReleasedContainerNotRecovered[2]

Error Message:
org/apache/hadoop/yarn/state/SingleArcTransition

Stack Trace:
java.lang.NoClassDefFoundError: org/apache/hadoop/yarn/state/SingleArcTransition
	at java.net.URLClassLoader$1.run(URLClassLoader.java:366)
	at java.net.URLClassLoader$1.run(URLClassLoader.java:355)
	at java.security.AccessController.doPrivileged(Native Method)
	at java.net.URLClassLoader.findClass(URLClassLoader.java:354)
	at java.lang.ClassLoader.loadClass(ClassLoader.java:425)
	at sun.misc.Launcher$AppClassLoader.loadClass(Launcher.java:308)
	at java.lang.ClassLoader.loadClass(ClassLoader.java:358)
	at org.apache.hadoop.yarn.server.resourcemanager.TestWorkPreservingRMRestart.testReleasedContainerNotRecovered(TestWorkPreservingRMRestart.java:844)


FAILED:  org.apache.hadoop.yarn.server.resourcemanager.TestWorkPreservingRMRestart.testAppFailedToRenewTokenOnRecovery[2]

Error Message:
org/apache/hadoop/yarn/state/SingleArcTransition

Stack Trace:
java.lang.NoClassDefFoundError: org/apache/hadoop/yarn/state/SingleArcTransition
	at java.net.URLClassLoader$1.run(URLClassLoader.java:366)
	at java.net.URLClassLoader$1.run(URLClassLoader.java:355)
	at java.security.AccessController.doPrivileged(Native Method)
	at java.net.URLClassLoader.findClass(URLClassLoader.java:354)
	at java.lang.ClassLoader.loadClass(ClassLoader.java:425)
	at sun.misc.Launcher$AppClassLoader.loadClass(Launcher.java:308)
	at java.lang.ClassLoader.loadClass(ClassLoader.java:358)
	at org.apache.hadoop.yarn.server.resourcemanager.TestWorkPreservingRMRestart.testAppFailedToRenewTokenOnRecovery(TestWorkPreservingRMRestart.java:1033)


FAILED:  org.apache.hadoop.yarn.server.resourcemanager.TestWorkPreservingRMRestart.testNewContainersNotAllocatedDuringSchedulerRecovery[2]

Error Message:
org/apache/hadoop/yarn/state/SingleArcTransition

Stack Trace:
java.lang.NoClassDefFoundError: org/apache/hadoop/yarn/state/SingleArcTransition
	at java.net.URLClassLoader$1.run(URLClassLoader.java:366)
	at java.net.URLClassLoader$1.run(URLClassLoader.java:355)
	at java.security.AccessController.doPrivileged(Native Method)
	at java.net.URLClassLoader.findClass(URLClassLoader.java:354)
	at java.lang.ClassLoader.loadClass(ClassLoader.java:425)
	at sun.misc.Launcher$AppClassLoader.loadClass(Launcher.java:308)
	at java.lang.ClassLoader.loadClass(ClassLoader.java:358)
	at org.apache.hadoop.yarn.server.resourcemanager.TestWorkPreservingRMRestart.testNewContainersNotAllocatedDuringSchedulerRecovery(TestWorkPreservingRMRestart.java:942)


FAILED:  org.apache.hadoop.yarn.server.resourcemanager.TestWorkPreservingRMRestart.testSchedulerRecovery[2]

Error Message:
org/apache/hadoop/yarn/util/resource/DominantResourceCalculator

Stack Trace:
java.lang.NoClassDefFoundError: org/apache/hadoop/yarn/util/resource/DominantResourceCalculator
	at org.apache.hadoop.yarn.server.resourcemanager.TestWorkPreservingRMRestart.testSchedulerRecovery(TestWorkPreservingRMRestart.java:153)


FAILED:  org.apache.hadoop.yarn.server.resourcemanager.TestWorkPreservingRMRestart.testAMContainerStatusWithRMRestart[2]

Error Message:
org/apache/hadoop/yarn/state/SingleArcTransition

Stack Trace:
java.lang.NoClassDefFoundError: org/apache/hadoop/yarn/state/SingleArcTransition
	at java.net.URLClassLoader$1.run(URLClassLoader.java:366)
	at java.net.URLClassLoader$1.run(URLClassLoader.java:355)
	at java.security.AccessController.doPrivileged(Native Method)
	at java.net.URLClassLoader.findClass(URLClassLoader.java:354)
	at java.lang.ClassLoader.loadClass(ClassLoader.java:425)
	at sun.misc.Launcher$AppClassLoader.loadClass(Launcher.java:308)
	at java.lang.ClassLoader.loadClass(ClassLoader.java:358)
	at org.apache.hadoop.yarn.server.resourcemanager.TestWorkPreservingRMRestart.testAMContainerStatusWithRMRestart(TestWorkPreservingRMRestart.java:774)


FAILED:  org.apache.hadoop.yarn.server.resourcemanager.recovery.TestFSRMStateStore.testFSRMStateStoreClientRetry

Error Message:
null

Stack Trace:
java.lang.AssertionError: null
	at org.junit.Assert.fail(Assert.java:86)
	at org.junit.Assert.assertTrue(Assert.java:41)
	at org.junit.Assert.assertFalse(Assert.java:64)
	at org.junit.Assert.assertFalse(Assert.java:74)
	at org.apache.hadoop.yarn.server.resourcemanager.recovery.TestFSRMStateStore.testFSRMStateStoreClientRetry(TestFSRMStateStore.java:289)



Mime
  • Unnamed multipart/mixed (inline, None, 0 bytes)
View raw message