hadoop-yarn-dev mailing list archives

Site index · List index
Message view « Date » · « Thread »
Top « Date » · « Thread »
From Apache Jenkins Server <jenk...@builds.apache.org>
Subject Failed: YARN-3852 PreCommit Build #8463
Date Thu, 09 Jul 2015 00:19:34 GMT
Jira: https://issues.apache.org/jira/browse/YARN-3852
Build: https://builds.apache.org/job/PreCommit-YARN-Build/8463/

###################################################################################
########################## LAST 60 LINES OF THE CONSOLE ###########################
[...truncated 242 lines...]
|  -1  |         whitespace  |  0m 4s     | The patch has 1 line(s) that end in 
|      |                     |            | whitespace. Use git apply
|      |                     |            | --whitespace=fix.
|  +1  |            install  |  1m 19s    | mvn install still works. 
|  +1  |    eclipse:eclipse  |  0m 33s    | The patch built with 
|      |                     |            | eclipse:eclipse.
|  -1  |         yarn tests  |  5m 59s    | Tests failed in 
|      |                     |            | hadoop-yarn-server-nodemanager.
|      |                     |  21m 31s   | 


             Reason | Tests
 Failed unit tests  |  hadoop.yarn.server.nodemanager.TestDeletionService 
                    |  hadoop.yarn.server.nodemanager.containermanager.linux.privileged.TestPrivilegedOperationExecutor



|| Subsystem || Report/Notes ||
============================================================================
| Patch URL | http://issues.apache.org/jira/secure/attachment/12744358/YARN-3852.patch |
| Optional Tests | javac unit |
| git revision | trunk / 2e3d83f |
| whitespace | /home/jenkins/jenkins-slave/workspace/PreCommit-YARN-Build/patchprocess/whitespace.txt
|
| hadoop-yarn-server-nodemanager test log | /home/jenkins/jenkins-slave/workspace/PreCommit-YARN-Build/patchprocess/testrun_hadoop-yarn-server-nodemanager.txt
|
| Test Results | https://builds.apache.org/job/PreCommit-YARN-Build/8463/testReport/ |
| Java | 1.7.0_55 |
| uname | Linux asf905.gq1.ygridcore.net 3.13.0-36-lowlatency #63-Ubuntu SMP PREEMPT Wed Sep
3 21:56:12 UTC 2014 x86_64 x86_64 x86_64 GNU/Linux |


============================================================================
============================================================================
                          Adding comment to JIRA
============================================================================
============================================================================


Comment added.
73301fd0ff85fe80a503349cde031158fd8de9d2 logged out


============================================================================
============================================================================
                              Finished build.
============================================================================
============================================================================


Build step 'Execute shell' marked build as failure
Archiving artifacts
Sending artifact delta relative to PreCommit-YARN-Build #8445
Archived 14 artifacts
Archive block size is 32768
Received 31 blocks and 2962830 bytes
Compression is 25.5%
Took 0.8 sec
[description-setter] Could not determine description.
Recording test results
Publish JUnit test result report is waiting for a checkpoint on PreCommit-YARN-Build #8462
Email was triggered for: Failure
Sending email for trigger: Failure



###################################################################################
############################## FAILED TESTS (if any) ##############################
2 tests failed.
FAILED:  org.apache.hadoop.yarn.server.nodemanager.TestDeletionService.testAbsDelete

Error Message:
/home/jenkins/jenkins-slave/workspace/PreCommit-YARN-Build/hadoop-yarn-project/hadoop-yarn/hadoop-yarn-server/hadoop-yarn-server-nodemanager/target/org.apache.hadoop.yarn.server.nodemanager.TestDeletionService/5490551821339358793

Stack Trace:
java.nio.file.NoSuchFileException: /home/jenkins/jenkins-slave/workspace/PreCommit-YARN-Build/hadoop-yarn-project/hadoop-yarn/hadoop-yarn-server/hadoop-yarn-server-nodemanager/target/org.apache.hadoop.yarn.server.nodemanager.TestDeletionService/5490551821339358793
	at sun.nio.fs.UnixException.translateToIOException(UnixException.java:86)
	at sun.nio.fs.UnixException.rethrowAsIOException(UnixException.java:102)
	at sun.nio.fs.UnixException.rethrowAsIOException(UnixException.java:107)
	at sun.nio.fs.UnixFileAttributeViews$Basic.readAttributes(UnixFileAttributeViews.java:55)
	at sun.nio.fs.UnixFileSystemProvider.readAttributes(UnixFileSystemProvider.java:144)
	at sun.nio.fs.LinuxFileSystemProvider.readAttributes(LinuxFileSystemProvider.java:97)
	at java.nio.file.Files.readAttributes(Files.java:1684)
	at org.apache.hadoop.fs.RawLocalFileSystem$DeprecatedRawLocalFileStatus.<init>(RawLocalFileSystem.java:653)
	at org.apache.hadoop.fs.RawLocalFileSystem.deprecatedGetFileStatus(RawLocalFileSystem.java:634)
	at org.apache.hadoop.fs.RawLocalFileSystem.getFileLinkStatusInternal(RawLocalFileSystem.java:850)
	at org.apache.hadoop.fs.RawLocalFileSystem.getFileStatus(RawLocalFileSystem.java:627)
	at org.apache.hadoop.fs.DelegateToFileSystem.getFileStatus(DelegateToFileSystem.java:110)
	at org.apache.hadoop.fs.FilterFs.getFileStatus(FilterFs.java:121)
	at org.apache.hadoop.fs.FileContext$15.next(FileContext.java:1163)
	at org.apache.hadoop.fs.FileContext$15.next(FileContext.java:1159)
	at org.apache.hadoop.fs.FSLinkResolver.resolve(FSLinkResolver.java:90)
	at org.apache.hadoop.fs.FileContext.getFileStatus(FileContext.java:1159)
	at org.apache.hadoop.fs.FileContext$Util.exists(FileContext.java:1624)
	at org.apache.hadoop.yarn.server.nodemanager.TestDeletionService.testAbsDelete(TestDeletionService.java:132)


FAILED:  org.apache.hadoop.yarn.server.nodemanager.containermanager.linux.privileged.TestPrivilegedOperationExecutor.testSquashCGroupOperationsWithValidOperations

Error Message:
expected:<...n/container_01/tasks[,net_cls/hadoop_yarn/container_01/tasks,]blkio/hadoop_yarn/co...>
but was:<...n/container_01/tasks[%net_cls/hadoop_yarn/container_01/tasks%]blkio/hadoop_yarn/co...>

Stack Trace:
org.junit.ComparisonFailure: expected:<...n/container_01/tasks[,net_cls/hadoop_yarn/container_01/tasks,]blkio/hadoop_yarn/co...>
but was:<...n/container_01/tasks[%net_cls/hadoop_yarn/container_01/tasks%]blkio/hadoop_yarn/co...>
	at org.junit.Assert.assertEquals(Assert.java:115)
	at org.junit.Assert.assertEquals(Assert.java:144)
	at org.apache.hadoop.yarn.server.nodemanager.containermanager.linux.privileged.TestPrivilegedOperationExecutor.testSquashCGroupOperationsWithValidOperations(TestPrivilegedOperationExecutor.java:227)



Mime
  • Unnamed multipart/mixed (inline, None, 0 bytes)
View raw message