hadoop-yarn-dev mailing list archives

Site index · List index
Message view « Date » · « Thread »
Top « Date » · « Thread »
From Apache Jenkins Server <jenk...@builds.apache.org>
Subject Failed: YARN-3381 PreCommit Build #8470
Date Thu, 09 Jul 2015 09:34:43 GMT
Jira: https://issues.apache.org/jira/browse/YARN-3381
Build: https://builds.apache.org/job/PreCommit-YARN-Build/8470/

###################################################################################
########################## LAST 60 LINES OF THE CONSOLE ###########################
[...truncated 417 lines...]
|  +1  |         yarn tests  |  1m 56s    | Tests passed in hadoop-yarn-common. 
|  -1  |         yarn tests  |  6m 0s     | Tests failed in 
|      |                     |            | hadoop-yarn-server-nodemanager.
|  +1  |         yarn tests  |  50m 51s   | Tests passed in 
|      |                     |            | hadoop-yarn-server-resourcemanager.
|      |                     |  124m 3s   | 


             Reason | Tests
 Failed unit tests  |  hadoop.yarn.server.nodemanager.TestNodeStatusUpdaterForLabels 


|| Subsystem || Report/Notes ||
============================================================================
| Patch URL | http://issues.apache.org/jira/secure/attachment/12744432/YARN-3381-006.patch
|
| Optional Tests | javadoc javac unit findbugs checkstyle |
| git revision | trunk / 63d0365 |
| Pre-patch Findbugs warnings | /home/jenkins/jenkins-slave/workspace/PreCommit-YARN-Build/patchprocess/trunkFindbugsWarningshadoop-mapreduce-client-app.html
|
| checkstyle |  /home/jenkins/jenkins-slave/workspace/PreCommit-YARN-Build/patchprocess/diffcheckstylehadoop-yarn-common.txt
|
| hadoop-mapreduce-client-app test log | /home/jenkins/jenkins-slave/workspace/PreCommit-YARN-Build/patchprocess/testrun_hadoop-mapreduce-client-app.txt
|
| hadoop-yarn-client test log | /home/jenkins/jenkins-slave/workspace/PreCommit-YARN-Build/patchprocess/testrun_hadoop-yarn-client.txt
|
| hadoop-yarn-common test log | /home/jenkins/jenkins-slave/workspace/PreCommit-YARN-Build/patchprocess/testrun_hadoop-yarn-common.txt
|
| hadoop-yarn-server-nodemanager test log | /home/jenkins/jenkins-slave/workspace/PreCommit-YARN-Build/patchprocess/testrun_hadoop-yarn-server-nodemanager.txt
|
| hadoop-yarn-server-resourcemanager test log | /home/jenkins/jenkins-slave/workspace/PreCommit-YARN-Build/patchprocess/testrun_hadoop-yarn-server-resourcemanager.txt
|
| Test Results | https://builds.apache.org/job/PreCommit-YARN-Build/8470/testReport/ |
| Java | 1.7.0_55 |
| uname | Linux asf907.gq1.ygridcore.net 3.13.0-36-lowlatency #63-Ubuntu SMP PREEMPT Wed Sep
3 21:56:12 UTC 2014 x86_64 x86_64 x86_64 GNU/Linux |


============================================================================
============================================================================
                          Adding comment to JIRA
============================================================================
============================================================================


Comment added.
bfacf148f3b3b894df12f9491896a424020e87af logged out


============================================================================
============================================================================
                              Finished build.
============================================================================
============================================================================


Build step 'Execute shell' marked build as failure
Archiving artifacts
Sending artifact delta relative to PreCommit-YARN-Build #8465
Archived 86 artifacts
Archive block size is 32768
Received 64 blocks and 15179965 bytes
Compression is 12.1%
Took 2.8 sec
[description-setter] Could not determine description.
Recording test results
Email was triggered for: Failure
Sending email for trigger: Failure



###################################################################################
############################## FAILED TESTS (if any) ##############################
1 tests failed.
FAILED:  org.apache.hadoop.yarn.server.nodemanager.TestNodeStatusUpdaterForLabels.testNodeStatusUpdaterForNodeLabels

Error Message:
null

Stack Trace:
java.lang.NullPointerException: null
	at org.apache.hadoop.yarn.server.nodemanager.TestNodeStatusUpdaterForLabels.testNodeStatusUpdaterForNodeLabels(TestNodeStatusUpdaterForLabels.java:286)



Mime
  • Unnamed multipart/mixed (inline, None, 0 bytes)
View raw message