hadoop-yarn-dev mailing list archives

Site index · List index
Message view « Date » · « Thread »
Top « Date » · « Thread »
From Apache Jenkins Server <jenk...@builds.apache.org>
Subject Failed: YARN-4019 PreCommit Build #8766
Date Wed, 05 Aug 2015 00:34:58 GMT
Jira: https://issues.apache.org/jira/browse/YARN-4019
Build: https://builds.apache.org/job/PreCommit-YARN-Build/8766/

###################################################################################
########################## LAST 60 LINES OF THE CONSOLE ###########################
[...truncated 319 lines...]
|      |                     |            | eclipse:eclipse.
|  +1  |           findbugs  |  2m 45s    | The patch does not introduce any 
|      |                     |            | new Findbugs (version 3.0.0)
|      |                     |            | warnings.
|  -1  |         yarn tests  |  6m 13s    | Tests failed in 
|      |                     |            | hadoop-yarn-server-nodemanager.
|  +1  |         yarn tests  |  53m 12s   | Tests passed in 
|      |                     |            | hadoop-yarn-server-resourcemanager.
|      |                     |  102m 45s  | 


             Reason | Tests
 Failed unit tests  |  hadoop.yarn.server.nodemanager.TestDeletionService 


|| Subsystem || Report/Notes ||
============================================================================
| Patch URL | http://issues.apache.org/jira/secure/attachment/12748746/YARN-4019.001.patch
|
| Optional Tests | javadoc javac unit findbugs checkstyle |
| git revision | trunk / c95993c |
| checkstyle |  /home/jenkins/jenkins-slave/workspace/PreCommit-YARN-Build/patchprocess/diffcheckstylehadoop-yarn-server-nodemanager.txt
/home/jenkins/jenkins-slave/workspace/PreCommit-YARN-Build/patchprocess/diffcheckstylehadoop-yarn-server-resourcemanager.txt
|
| whitespace | /home/jenkins/jenkins-slave/workspace/PreCommit-YARN-Build/patchprocess/whitespace.txt
|
| hadoop-yarn-server-nodemanager test log | /home/jenkins/jenkins-slave/workspace/PreCommit-YARN-Build/patchprocess/testrun_hadoop-yarn-server-nodemanager.txt
|
| hadoop-yarn-server-resourcemanager test log | /home/jenkins/jenkins-slave/workspace/PreCommit-YARN-Build/patchprocess/testrun_hadoop-yarn-server-resourcemanager.txt
|
| Test Results | https://builds.apache.org/job/PreCommit-YARN-Build/8766/testReport/ |
| Java | 1.7.0_55 |
| uname | Linux asf903.gq1.ygridcore.net 3.13.0-36-lowlatency #63-Ubuntu SMP PREEMPT Wed Sep
3 21:56:12 UTC 2014 x86_64 x86_64 x86_64 GNU/Linux |


============================================================================
============================================================================
                          Adding comment to JIRA
============================================================================
============================================================================


Comment added.
1f476ebe24dacb5a8824fb6cf36e6c756326fc1e logged out


============================================================================
============================================================================
                              Finished build.
============================================================================
============================================================================


Build step 'Execute shell' marked build as failure
Archiving artifacts
Sending artifact delta relative to PreCommit-YARN-Build #8763
Archived 45 artifacts
Archive block size is 32768
Received 87 blocks and 12839524 bytes
Compression is 18.2%
Took 2.9 sec
[description-setter] Could not determine description.
Recording test results
Email was triggered for: Failure
Sending email for trigger: Failure



###################################################################################
############################## FAILED TESTS (if any) ##############################
1 tests failed.
FAILED:  org.apache.hadoop.yarn.server.nodemanager.TestDeletionService.testAbsDelete

Error Message:
/home/jenkins/jenkins-slave/workspace/PreCommit-YARN-Build/hadoop-yarn-project/hadoop-yarn/hadoop-yarn-server/hadoop-yarn-server-nodemanager/target/org.apache.hadoop.yarn.server.nodemanager.TestDeletionService/-2896630089026491763

Stack Trace:
java.nio.file.NoSuchFileException: /home/jenkins/jenkins-slave/workspace/PreCommit-YARN-Build/hadoop-yarn-project/hadoop-yarn/hadoop-yarn-server/hadoop-yarn-server-nodemanager/target/org.apache.hadoop.yarn.server.nodemanager.TestDeletionService/-2896630089026491763
	at sun.nio.fs.UnixException.translateToIOException(UnixException.java:86)
	at sun.nio.fs.UnixException.rethrowAsIOException(UnixException.java:102)
	at sun.nio.fs.UnixException.rethrowAsIOException(UnixException.java:107)
	at sun.nio.fs.UnixFileAttributeViews$Basic.readAttributes(UnixFileAttributeViews.java:55)
	at sun.nio.fs.UnixFileSystemProvider.readAttributes(UnixFileSystemProvider.java:144)
	at sun.nio.fs.LinuxFileSystemProvider.readAttributes(LinuxFileSystemProvider.java:97)
	at java.nio.file.Files.readAttributes(Files.java:1684)
	at org.apache.hadoop.fs.RawLocalFileSystem$DeprecatedRawLocalFileStatus.<init>(RawLocalFileSystem.java:656)
	at org.apache.hadoop.fs.RawLocalFileSystem.deprecatedGetFileStatus(RawLocalFileSystem.java:637)
	at org.apache.hadoop.fs.RawLocalFileSystem.getFileLinkStatusInternal(RawLocalFileSystem.java:853)
	at org.apache.hadoop.fs.RawLocalFileSystem.getFileStatus(RawLocalFileSystem.java:630)
	at org.apache.hadoop.fs.DelegateToFileSystem.getFileStatus(DelegateToFileSystem.java:110)
	at org.apache.hadoop.fs.FilterFs.getFileStatus(FilterFs.java:121)
	at org.apache.hadoop.fs.FileContext$15.next(FileContext.java:1164)
	at org.apache.hadoop.fs.FileContext$15.next(FileContext.java:1160)
	at org.apache.hadoop.fs.FSLinkResolver.resolve(FSLinkResolver.java:90)
	at org.apache.hadoop.fs.FileContext.getFileStatus(FileContext.java:1160)
	at org.apache.hadoop.fs.FileContext$Util.exists(FileContext.java:1625)
	at org.apache.hadoop.yarn.server.nodemanager.TestDeletionService.testAbsDelete(TestDeletionService.java:132)



Mime
  • Unnamed multipart/mixed (inline, None, 0 bytes)
View raw message