hadoop-yarn-dev mailing list archives

Site index · List index
Message view « Date » · « Thread »
Top « Date » · « Thread »
From Apache Jenkins Server <jenk...@builds.apache.org>
Subject Failed: YARN-3983 PreCommit Build #8745
Date Sat, 01 Aug 2015 03:25:00 GMT
Jira: https://issues.apache.org/jira/browse/YARN-3983
Build: https://builds.apache.org/job/PreCommit-YARN-Build/8745/

###################################################################################
########################## LAST 60 LINES OF THE CONSOLE ###########################
[...truncated 337 lines...]
|      |                     |            | --whitespace=fix.
|  +1  |            install  |  1m 25s    | mvn install still works. 
|  +1  |    eclipse:eclipse  |  0m 34s    | The patch built with 
|      |                     |            | eclipse:eclipse.
|  +1  |           findbugs  |  1m 27s    | The patch does not introduce any 
|      |                     |            | new Findbugs (version 3.0.0)
|      |                     |            | warnings.
|  -1  |         yarn tests  |  52m 51s   | Tests failed in 
|      |                     |            | hadoop-yarn-server-resourcemanager.
|      |                     |  90m 39s   | 


             Reason | Tests
 Failed unit tests  |  hadoop.yarn.server.resourcemanager.scheduler.fair.TestAllocationFileLoaderService



|| Subsystem || Report/Notes ||
============================================================================
| Patch URL | http://issues.apache.org/jira/secure/attachment/12748251/YARN-3983.3.patch |
| Optional Tests | javadoc javac unit findbugs checkstyle |
| git revision | trunk / d311a38 |
| Release Audit | /home/jenkins/jenkins-slave/workspace/PreCommit-YARN-Build@2/patchprocess/patchReleaseAuditProblems.txt
|
| whitespace | /home/jenkins/jenkins-slave/workspace/PreCommit-YARN-Build@2/patchprocess/whitespace.txt
|
| hadoop-yarn-server-resourcemanager test log | /home/jenkins/jenkins-slave/workspace/PreCommit-YARN-Build@2/patchprocess/testrun_hadoop-yarn-server-resourcemanager.txt
|
| Test Results | https://builds.apache.org/job/PreCommit-YARN-Build/8745/testReport/ |
| Java | 1.7.0_55 |
| uname | Linux asf904.gq1.ygridcore.net 3.13.0-36-lowlatency #63-Ubuntu SMP PREEMPT Wed Sep
3 21:56:12 UTC 2014 x86_64 x86_64 x86_64 GNU/Linux |


============================================================================
============================================================================
                          Adding comment to JIRA
============================================================================
============================================================================


Comment added.
948c968d500e2ed4ea8971ce3386e5d352446570 logged out


============================================================================
============================================================================
                              Finished build.
============================================================================
============================================================================


Build step 'Execute shell' marked build as failure
Archiving artifacts
Sending artifact delta relative to PreCommit-YARN-Build #8718
Archived 28 artifacts
Archive block size is 32768
Received 3 blocks and 9171029 bytes
Compression is 1.1%
Took 1.9 sec
[description-setter] Could not determine description.
Recording test results
Email was triggered for: Failure
Sending email for trigger: Failure



###################################################################################
############################## FAILED TESTS (if any) ##############################
1 tests failed.
FAILED:  org.apache.hadoop.yarn.server.resourcemanager.scheduler.fair.TestAllocationFileLoaderService.testGetAllocationFileFromClasspath

Error Message:
null

Stack Trace:
java.lang.AssertionError: null
	at org.junit.Assert.fail(Assert.java:86)
	at org.junit.Assert.assertTrue(Assert.java:41)
	at org.junit.Assert.assertTrue(Assert.java:52)
	at org.apache.hadoop.yarn.server.resourcemanager.scheduler.fair.TestAllocationFileLoaderService.testGetAllocationFileFromClasspath(TestAllocationFileLoaderService.java:54)



Mime
  • Unnamed multipart/mixed (inline, None, 0 bytes)
View raw message