hadoop-yarn-dev mailing list archives

Site index · List index
Message view « Date » · « Thread »
Top « Date » · « Thread »
From Apache Jenkins Server <jenk...@builds.apache.org>
Subject Failed: YARN-3816 PreCommit Build #8971
Date Wed, 02 Sep 2015 11:24:32 GMT
Jira: https://issues.apache.org/jira/browse/YARN-3816
Build: https://builds.apache.org/job/PreCommit-YARN-Build/8971/

###################################################################################
########################## LAST 60 LINES OF THE CONSOLE ###########################
[...truncated 451 lines...]
|      |                     |            | hadoop-yarn-server-timelineservice.
|      |                     |  57m 57s   | 


             Reason | Tests
          FindBugs  |  module:hadoop-yarn-api 
          FindBugs  |  module:hadoop-yarn-server-timelineservice 
 Failed unit tests  |  hadoop.yarn.api.records.timelineservice.TestTimelineServiceRecords



|| Subsystem || Report/Notes ||
============================================================================
| Patch URL | http://issues.apache.org/jira/secure/attachment/12753636/YARN-3816-YARN-2928-v2.patch
|
| Optional Tests | javadoc javac unit findbugs checkstyle |
| git revision | YARN-2928 / e6afe26 |
| javadoc | /home/jenkins/jenkins-slave/workspace/PreCommit-YARN-Build/patchprocess/diffJavadocWarnings.txt
|
| checkstyle |  /home/jenkins/jenkins-slave/workspace/PreCommit-YARN-Build/patchprocess/diffcheckstylehadoop-yarn-api.txt
|
| whitespace | /home/jenkins/jenkins-slave/workspace/PreCommit-YARN-Build/patchprocess/whitespace.txt
|
| Findbugs warnings | /home/jenkins/jenkins-slave/workspace/PreCommit-YARN-Build/patchprocess/newPatchFindbugsWarningshadoop-yarn-api.html
|
| Findbugs warnings | /home/jenkins/jenkins-slave/workspace/PreCommit-YARN-Build/patchprocess/newPatchFindbugsWarningshadoop-yarn-server-timelineservice.html
|
| hadoop-yarn-api test log | /home/jenkins/jenkins-slave/workspace/PreCommit-YARN-Build/patchprocess/testrun_hadoop-yarn-api.txt
|
| hadoop-yarn-common test log | /home/jenkins/jenkins-slave/workspace/PreCommit-YARN-Build/patchprocess/testrun_hadoop-yarn-common.txt
|
| hadoop-yarn-server-nodemanager test log | /home/jenkins/jenkins-slave/workspace/PreCommit-YARN-Build/patchprocess/testrun_hadoop-yarn-server-nodemanager.txt
|
| hadoop-yarn-server-timelineservice test log | /home/jenkins/jenkins-slave/workspace/PreCommit-YARN-Build/patchprocess/testrun_hadoop-yarn-server-timelineservice.txt
|
| Test Results | https://builds.apache.org/job/PreCommit-YARN-Build/8971/testReport/ |
| Java | 1.7.0_55 |
| uname | Linux asf903.gq1.ygridcore.net 3.13.0-36-lowlatency #63-Ubuntu SMP PREEMPT Wed Sep
3 21:56:12 UTC 2014 x86_64 x86_64 x86_64 GNU/Linux |


============================================================================
============================================================================
                          Adding comment to JIRA
============================================================================
============================================================================


Comment added.
e9b342b0d211e0c12f2274b0d3929b776a24f6a3 logged out


============================================================================
============================================================================
                              Finished build.
============================================================================
============================================================================


Build step 'Execute shell' marked build as failure
Archiving artifacts
Sending artifact delta relative to PreCommit-YARN-Build #8944
Archived 67 artifacts
Archive block size is 32768
Received 41 blocks and 28403093 bytes
Compression is 4.5%
Took 6.5 sec
[description-setter] Could not determine description.
Recording test results
Email was triggered for: Failure
Sending email for trigger: Failure



###################################################################################
############################## FAILED TESTS (if any) ##############################
1 tests failed.
FAILED:  org.apache.hadoop.yarn.api.records.timelineservice.TestTimelineServiceRecords.testTimelineEntities

Error Message:
expected:<3> but was:<1>

Stack Trace:
java.lang.AssertionError: expected:<3> but was:<1>
	at org.junit.Assert.fail(Assert.java:88)
	at org.junit.Assert.failNotEquals(Assert.java:743)
	at org.junit.Assert.assertEquals(Assert.java:118)
	at org.junit.Assert.assertEquals(Assert.java:144)
	at org.apache.hadoop.yarn.api.records.timelineservice.TestTimelineServiceRecords.testTimelineEntities(TestTimelineServiceRecords.java:66)



Mime
  • Unnamed multipart/mixed (inline, None, 0 bytes)
View raw message