hadoop-yarn-dev mailing list archives

Site index · List index
Message view « Date » · « Thread »
Top « Date » · « Thread »
From Apache Jenkins Server <jenk...@builds.apache.org>
Subject Hadoop-Yarn-trunk-Java8 - Build # 512 - Still Failing
Date Fri, 09 Oct 2015 05:03:48 GMT
See https://builds.apache.org/job/Hadoop-Yarn-trunk-Java8/512/

###################################################################################
########################## LAST 60 LINES OF THE CONSOLE ###########################
[...truncated 5783 lines...]
# See problematic frame for where to report the bug.
#
Aborted
Java HotSpot(TM) 64-Bit Server VM warning: ignoring option MaxPermSize=768m; support was removed
in 8.0
Running org.apache.hadoop.yarn.applications.distributedshell.TestDistributedShellWithNodeLabels
Tests run: 1, Failures: 0, Errors: 0, Skipped: 0, Time elapsed: 36.15 sec - in org.apache.hadoop.yarn.applications.distributedshell.TestDistributedShellWithNodeLabels

Results :

Tests run: 3, Failures: 0, Errors: 0, Skipped: 0

[INFO] ------------------------------------------------------------------------
[INFO] Reactor Summary:
[INFO] 
[INFO] Apache Hadoop YARN ................................ SUCCESS [  3.009 s]
[INFO] Apache Hadoop YARN API ............................ SUCCESS [01:18 min]
[INFO] Apache Hadoop YARN Common ......................... SUCCESS [02:21 min]
[INFO] Apache Hadoop YARN Server ......................... SUCCESS [  0.080 s]
[INFO] Apache Hadoop YARN Server Common .................. SUCCESS [ 38.473 s]
[INFO] Apache Hadoop YARN NodeManager .................... SUCCESS [08:56 min]
[INFO] Apache Hadoop YARN Web Proxy ...................... SUCCESS [ 16.464 s]
[INFO] Apache Hadoop YARN ApplicationHistoryService ...... SUCCESS [03:11 min]
[INFO] Apache Hadoop YARN ResourceManager ................ SUCCESS [56:55 min]
[INFO] Apache Hadoop YARN Server Tests ................... SUCCESS [01:56 min]
[INFO] Apache Hadoop YARN Client ......................... SUCCESS [07:10 min]
[INFO] Apache Hadoop YARN SharedCacheManager ............. SUCCESS [ 19.278 s]
[INFO] Apache Hadoop YARN Applications ................... SUCCESS [  0.042 s]
[INFO] Apache Hadoop YARN DistributedShell ............... FAILURE [04:06 min]
[INFO] Apache Hadoop YARN Unmanaged Am Launcher .......... SKIPPED
[INFO] Apache Hadoop YARN Site ........................... SKIPPED
[INFO] Apache Hadoop YARN Registry ....................... SKIPPED
[INFO] Apache Hadoop YARN Project ........................ SKIPPED
[INFO] ------------------------------------------------------------------------
[INFO] BUILD FAILURE
[INFO] ------------------------------------------------------------------------
[INFO] Total time: 01:27 h
[INFO] Finished at: 2015-10-09T05:04:11+00:00
[INFO] Final Memory: 87M/1041M
[INFO] ------------------------------------------------------------------------
[ERROR] Failed to execute goal org.apache.maven.plugins:maven-surefire-plugin:2.17:test (default-test)
on project hadoop-yarn-applications-distributedshell: ExecutionException: java.lang.RuntimeException:
The forked VM terminated without properly saying goodbye. VM crash or System.exit called?
[ERROR] Command was /bin/sh -c cd /home/jenkins/jenkins-slave/workspace/Hadoop-Yarn-trunk-Java8/hadoop-yarn-project/hadoop-yarn/hadoop-yarn-applications/hadoop-yarn-applications-distributedshell
&& /home/jenkins/tools/java/jdk1.8.0/jre/bin/java -Xmx2048m -XX:MaxPermSize=768m -XX:+HeapDumpOnOutOfMemoryError
-jar /home/jenkins/jenkins-slave/workspace/Hadoop-Yarn-trunk-Java8/hadoop-yarn-project/hadoop-yarn/hadoop-yarn-applications/hadoop-yarn-applications-distributedshell/target/surefire/surefirebooter7520137293926184382.jar
/home/jenkins/jenkins-slave/workspace/Hadoop-Yarn-trunk-Java8/hadoop-yarn-project/hadoop-yarn/hadoop-yarn-applications/hadoop-yarn-applications-distributedshell/target/surefire/surefire9114193011464131584tmp
/home/jenkins/jenkins-slave/workspace/Hadoop-Yarn-trunk-Java8/hadoop-yarn-project/hadoop-yarn/hadoop-yarn-applications/hadoop-yarn-applications-distributedshell/target/surefire/surefire_3321169359496707521504tmp
[ERROR] -> [Help 1]
[ERROR] 
[ERROR] To see the full stack trace of the errors, re-run Maven with the -e switch.
[ERROR] Re-run Maven using the -X switch to enable full debug logging.
[ERROR] 
[ERROR] For more information about the errors and possible solutions, please read the following
articles:
[ERROR] [Help 1] http://cwiki.apache.org/confluence/display/MAVEN/MojoFailureException
[ERROR] 
[ERROR] After correcting the problems, you can resume the build with the command
[ERROR]   mvn <goals> -rf :hadoop-yarn-applications-distributedshell
Build step 'Execute shell' marked build as failure
Archiving artifacts
Recording test results
Updating HADOOP-11104
Updating MAPREDUCE-6479
Sending e-mails to: yarn-dev@hadoop.apache.org
Email was triggered for: Failure - Any
Sending email for trigger: Failure - Any



###################################################################################
############################## FAILED TESTS (if any) ##############################
All tests passed
Mime
  • Unnamed multipart/mixed (inline, None, 0 bytes)
View raw message