hadoop-yarn-dev mailing list archives

Site index · List index
Message view « Date » · « Thread »
Top « Date » · « Thread »
From Apache Jenkins Server <jenk...@builds.apache.org>
Subject Hadoop-Yarn-trunk - Build # 1393 - Still Failing
Date Wed, 11 Nov 2015 18:21:09 GMT
See https://builds.apache.org/job/Hadoop-Yarn-trunk/1393/

###################################################################################
########################## LAST 60 LINES OF THE CONSOLE ###########################
[...truncated 8821 lines...]
Tests run: 2, Failures: 0, Errors: 0, Skipped: 0, Time elapsed: 1.443 sec - in org.apache.hadoop.yarn.server.timeline.recovery.TestLeveldbTimelineStateStore
Running org.apache.hadoop.yarn.server.timeline.TestTimelineDataManager
Tests run: 4, Failures: 0, Errors: 0, Skipped: 0, Time elapsed: 6.022 sec - in org.apache.hadoop.yarn.server.timeline.TestTimelineDataManager

Results :

Tests in error: 
  TestTimelineAuthenticationFilter.testPutDomains:200 ยป ClientHandler java.io.IO...

Tests run: 196, Failures: 0, Errors: 1, Skipped: 0

[INFO] ------------------------------------------------------------------------
[INFO] Reactor Summary:
[INFO] 
[INFO] Apache Hadoop YARN ................................ SUCCESS [  3.869 s]
[INFO] Apache Hadoop YARN API ............................ SUCCESS [04:36 min]
[INFO] Apache Hadoop YARN Common ......................... SUCCESS [03:22 min]
[INFO] Apache Hadoop YARN Server ......................... SUCCESS [  0.115 s]
[INFO] Apache Hadoop YARN Server Common .................. SUCCESS [ 51.126 s]
[INFO] Apache Hadoop YARN NodeManager .................... SUCCESS [09:48 min]
[INFO] Apache Hadoop YARN Web Proxy ...................... SUCCESS [ 29.647 s]
[INFO] Apache Hadoop YARN ApplicationHistoryService ...... FAILURE [03:10 min]
[INFO] Apache Hadoop YARN ResourceManager ................ SKIPPED
[INFO] Apache Hadoop YARN Server Tests ................... SKIPPED
[INFO] Apache Hadoop YARN Client ......................... SKIPPED
[INFO] Apache Hadoop YARN SharedCacheManager ............. SKIPPED
[INFO] Apache Hadoop YARN Applications ................... SKIPPED
[INFO] Apache Hadoop YARN DistributedShell ............... SKIPPED
[INFO] Apache Hadoop YARN Unmanaged Am Launcher .......... SKIPPED
[INFO] Apache Hadoop YARN Site ........................... SKIPPED
[INFO] Apache Hadoop YARN Registry ....................... SKIPPED
[INFO] Apache Hadoop YARN Project ........................ SKIPPED
[INFO] ------------------------------------------------------------------------
[INFO] BUILD FAILURE
[INFO] ------------------------------------------------------------------------
[INFO] Total time: 22:24 min
[INFO] Finished at: 2015-11-11T18:21:21+00:00
[INFO] Final Memory: 84M/920M
[INFO] ------------------------------------------------------------------------
[ERROR] Failed to execute goal org.apache.maven.plugins:maven-surefire-plugin:2.17:test (default-test)
on project hadoop-yarn-server-applicationhistoryservice: There are test failures.
[ERROR] 
[ERROR] Please refer to /home/jenkins/jenkins-slave/workspace/Hadoop-Yarn-trunk/hadoop-yarn-project/hadoop-yarn/hadoop-yarn-server/hadoop-yarn-server-applicationhistoryservice/target/surefire-reports
for the individual test results.
[ERROR] -> [Help 1]
[ERROR] 
[ERROR] To see the full stack trace of the errors, re-run Maven with the -e switch.
[ERROR] Re-run Maven using the -X switch to enable full debug logging.
[ERROR] 
[ERROR] For more information about the errors and possible solutions, please read the following
articles:
[ERROR] [Help 1] http://cwiki.apache.org/confluence/display/MAVEN/MojoFailureException
[ERROR] 
[ERROR] After correcting the problems, you can resume the build with the command
[ERROR]   mvn <goals> -rf :hadoop-yarn-server-applicationhistoryservice
Build step 'Execute shell' marked build as failure
Archiving artifacts
Recording test results
Updating MAPREDUCE-6533
Sending e-mails to: yarn-dev@hadoop.apache.org
Email was triggered for: Failure - Any
Sending email for trigger: Failure - Any



###################################################################################
############################## FAILED TESTS (if any) ##############################
1 tests failed.
FAILED:  org.apache.hadoop.yarn.server.timeline.security.TestTimelineAuthenticationFilter.testPutDomains[0]

Error Message:
java.io.IOException: org.apache.hadoop.security.authentication.client.AuthenticationException:
GSSException: No valid credentials provided (Mechanism level: Cannot get a KDC reply)

Stack Trace:
com.sun.jersey.api.client.ClientHandlerException: java.io.IOException: org.apache.hadoop.security.authentication.client.AuthenticationException:
GSSException: No valid credentials provided (Mechanism level: Cannot get a KDC reply)
	at sun.security.krb5.KdcComm.send(KdcComm.java:250)
	at sun.security.krb5.KdcComm.send(KdcComm.java:191)
	at sun.security.krb5.KrbTgsReq.send(KrbTgsReq.java:187)
	at sun.security.krb5.KrbTgsReq.sendAndGetCreds(KrbTgsReq.java:202)
	at sun.security.krb5.internal.CredentialsUtil.serviceCreds(CredentialsUtil.java:311)
	at sun.security.krb5.internal.CredentialsUtil.acquireServiceCreds(CredentialsUtil.java:115)
	at sun.security.krb5.Credentials.acquireServiceCreds(Credentials.java:449)
	at sun.security.jgss.krb5.Krb5Context.initSecContext(Krb5Context.java:641)
	at sun.security.jgss.GSSContextImpl.initSecContext(GSSContextImpl.java:248)
	at sun.security.jgss.GSSContextImpl.initSecContext(GSSContextImpl.java:179)
	at org.apache.hadoop.security.authentication.client.KerberosAuthenticator$1.run(KerberosAuthenticator.java:311)
	at org.apache.hadoop.security.authentication.client.KerberosAuthenticator$1.run(KerberosAuthenticator.java:287)
	at java.security.AccessController.doPrivileged(Native Method)
	at javax.security.auth.Subject.doAs(Subject.java:415)
	at org.apache.hadoop.security.authentication.client.KerberosAuthenticator.doSpnegoSequence(KerberosAuthenticator.java:287)
	at org.apache.hadoop.security.authentication.client.KerberosAuthenticator.authenticate(KerberosAuthenticator.java:205)
	at org.apache.hadoop.security.token.delegation.web.DelegationTokenAuthenticator.authenticate(DelegationTokenAuthenticator.java:128)
	at org.apache.hadoop.security.authentication.client.AuthenticatedURL.openConnection(AuthenticatedURL.java:215)
	at org.apache.hadoop.security.token.delegation.web.DelegationTokenAuthenticatedURL.openConnection(DelegationTokenAuthenticatedURL.java:322)
	at org.apache.hadoop.yarn.client.api.impl.TimelineClientImpl$TimelineURLConnectionFactory.getHttpURLConnection(TimelineClientImpl.java:493)
	at com.sun.jersey.client.urlconnection.URLConnectionClientHandler._invoke(URLConnectionClientHandler.java:159)
	at com.sun.jersey.client.urlconnection.URLConnectionClientHandler.handle(URLConnectionClientHandler.java:147)
	at org.apache.hadoop.yarn.client.api.impl.TimelineClientImpl$TimelineJerseyRetryFilter$1.run(TimelineClientImpl.java:234)
	at org.apache.hadoop.yarn.client.api.impl.TimelineClientImpl$TimelineClientConnectionRetry.retryOn(TimelineClientImpl.java:183)
	at org.apache.hadoop.yarn.client.api.impl.TimelineClientImpl$TimelineJerseyRetryFilter.handle(TimelineClientImpl.java:245)
	at com.sun.jersey.api.client.Client.handle(Client.java:648)
	at com.sun.jersey.api.client.WebResource.handle(WebResource.java:670)
	at com.sun.jersey.api.client.WebResource.access$200(WebResource.java:74)
	at com.sun.jersey.api.client.WebResource$Builder.put(WebResource.java:533)
	at org.apache.hadoop.yarn.client.api.impl.TimelineClientImpl.doPostingObject(TimelineClientImpl.java:478)
	at org.apache.hadoop.yarn.client.api.impl.TimelineClientImpl$1.run(TimelineClientImpl.java:323)
	at org.apache.hadoop.yarn.client.api.impl.TimelineClientImpl$1.run(TimelineClientImpl.java:320)
	at java.security.AccessController.doPrivileged(Native Method)
	at javax.security.auth.Subject.doAs(Subject.java:415)
	at org.apache.hadoop.security.UserGroupInformation.doAs(UserGroupInformation.java:1669)
	at org.apache.hadoop.yarn.client.api.impl.TimelineClientImpl.doPosting(TimelineClientImpl.java:320)
	at org.apache.hadoop.yarn.client.api.impl.TimelineClientImpl.putDomain(TimelineClientImpl.java:313)
	at org.apache.hadoop.yarn.server.timeline.security.TestTimelineAuthenticationFilter$2.call(TestTimelineAuthenticationFilter.java:208)
	at org.apache.hadoop.yarn.server.timeline.security.TestTimelineAuthenticationFilter$2.call(TestTimelineAuthenticationFilter.java:200)
	at org.apache.hadoop.security.authentication.KerberosTestUtils$1.run(KerberosTestUtils.java:120)
	at java.security.AccessController.doPrivileged(Native Method)
	at javax.security.auth.Subject.doAs(Subject.java:415)
	at org.apache.hadoop.security.authentication.KerberosTestUtils.doAs(KerberosTestUtils.java:117)
	at org.apache.hadoop.yarn.server.timeline.security.TestTimelineAuthenticationFilter.testPutDomains(TestTimelineAuthenticationFilter.java:200)



Mime
  • Unnamed multipart/mixed (inline, None, 0 bytes)
View raw message