hadoop-yarn-dev mailing list archives

Site index · List index
Message view « Date » · « Thread »
Top « Date » · « Thread »
From Apache Jenkins Server <jenk...@builds.apache.org>
Subject Hadoop-Yarn-trunk-Java8 - Build # 651 - Still Failing
Date Sat, 07 Nov 2015 17:59:22 GMT
See https://builds.apache.org/job/Hadoop-Yarn-trunk-Java8/651/

###################################################################################
########################## LAST 60 LINES OF THE CONSOLE ###########################
[...truncated 5467 lines...]
  TestRMWebappAuthentication.setUp:110->setupKDC:127 NoClassDefFound org/apache/...
  TestRMWebServicesApps.testAppsQueryFinishBegin:704 » ServiceConfiguration org....
  TestRMWebServicesApps.testAppStatistics:989 » NullPointer
  TestRMWebServicesApps.testMultipleAppAttempts:1452 » NullPointer
  TestRMWebServicesApps.testAppsQueryFinishEnd:734 » NullPointer
  TestRMWebServicesApps.testAppsQueryAppTypes:802 » NullPointer
  TestRMWebServicesApps.testAppsQueryFinishBeginEnd:768 » NullPointer

Tests run: 1252, Failures: 0, Errors: 7, Skipped: 1

[INFO] ------------------------------------------------------------------------
[INFO] Reactor Summary:
[INFO] 
[INFO] Apache Hadoop YARN ................................ SUCCESS [  3.080 s]
[INFO] Apache Hadoop YARN API ............................ SUCCESS [01:21 min]
[INFO] Apache Hadoop YARN Common ......................... SUCCESS [02:30 min]
[INFO] Apache Hadoop YARN Server ......................... SUCCESS [  0.051 s]
[INFO] Apache Hadoop YARN Server Common .................. SUCCESS [ 37.995 s]
[INFO] Apache Hadoop YARN NodeManager .................... SUCCESS [09:35 min]
[INFO] Apache Hadoop YARN Web Proxy ...................... SUCCESS [ 19.069 s]
[INFO] Apache Hadoop YARN ApplicationHistoryService ...... SUCCESS [03:59 min]
[INFO] Apache Hadoop YARN ResourceManager ................ FAILURE [  01:03 h]
[INFO] Apache Hadoop YARN Server Tests ................... SKIPPED
[INFO] Apache Hadoop YARN Client ......................... SKIPPED
[INFO] Apache Hadoop YARN SharedCacheManager ............. SKIPPED
[INFO] Apache Hadoop YARN Applications ................... SKIPPED
[INFO] Apache Hadoop YARN DistributedShell ............... SKIPPED
[INFO] Apache Hadoop YARN Unmanaged Am Launcher .......... SKIPPED
[INFO] Apache Hadoop YARN Site ........................... SKIPPED
[INFO] Apache Hadoop YARN Registry ....................... SKIPPED
[INFO] Apache Hadoop YARN Project ........................ SKIPPED
[INFO] ------------------------------------------------------------------------
[INFO] BUILD FAILURE
[INFO] ------------------------------------------------------------------------
[INFO] Total time: 01:21 h
[INFO] Finished at: 2015-11-07T17:59:26+00:00
[INFO] Final Memory: 62M/988M
[INFO] ------------------------------------------------------------------------
[ERROR] Failed to execute goal org.apache.maven.plugins:maven-surefire-plugin:2.17:test (default-test)
on project hadoop-yarn-server-resourcemanager: There are test failures.
[ERROR] 
[ERROR] Please refer to /home/jenkins/jenkins-slave/workspace/Hadoop-Yarn-trunk-Java8/hadoop-yarn-project/hadoop-yarn/hadoop-yarn-server/hadoop-yarn-server-resourcemanager/target/surefire-reports
for the individual test results.
[ERROR] -> [Help 1]
[ERROR] 
[ERROR] To see the full stack trace of the errors, re-run Maven with the -e switch.
[ERROR] Re-run Maven using the -X switch to enable full debug logging.
[ERROR] 
[ERROR] For more information about the errors and possible solutions, please read the following
articles:
[ERROR] [Help 1] http://cwiki.apache.org/confluence/display/MAVEN/MojoFailureException
[ERROR] 
[ERROR] After correcting the problems, you can resume the build with the command
[ERROR]   mvn <goals> -rf :hadoop-yarn-server-resourcemanager
Build step 'Execute shell' marked build as failure
Archiving artifacts
Recording test results
Updating HDFS-9394
Updating HADOOP-12366
Sending e-mails to: yarn-dev@hadoop.apache.org
Email was triggered for: Failure - Any
Sending email for trigger: Failure - Any



###################################################################################
############################## FAILED TESTS (if any) ##############################
7 tests failed.
FAILED:  org.apache.hadoop.yarn.server.resourcemanager.webapp.TestRMWebServicesApps.testAppsQueryFinishBegin

Error Message:
org.apache.hadoop.security.token.TokenIdentifier: Provider org.apache.hadoop.hdfs.security.token.block.BlockTokenIdentifier
not found

Stack Trace:
java.util.ServiceConfigurationError: org.apache.hadoop.security.token.TokenIdentifier: Provider
org.apache.hadoop.hdfs.security.token.block.BlockTokenIdentifier not found
	at java.util.ServiceLoader.fail(ServiceLoader.java:239)
	at java.util.ServiceLoader.access$300(ServiceLoader.java:185)
	at java.util.ServiceLoader$LazyIterator.nextService(ServiceLoader.java:372)
	at java.util.ServiceLoader$LazyIterator.next(ServiceLoader.java:404)
	at java.util.ServiceLoader$1.next(ServiceLoader.java:480)
	at org.apache.hadoop.security.token.Token.getClassForIdentifier(Token.java:114)
	at org.apache.hadoop.security.token.Token.decodeIdentifier(Token.java:135)
	at org.apache.hadoop.yarn.server.resourcemanager.MockAM.registerAppAttempt(MockAM.java:126)
	at org.apache.hadoop.yarn.server.resourcemanager.MockAM.registerAppAttempt(MockAM.java:106)
	at org.apache.hadoop.yarn.server.resourcemanager.webapp.TestRMWebServicesApps.testAppsQueryFinishBegin(TestRMWebServicesApps.java:704)


FAILED:  org.apache.hadoop.yarn.server.resourcemanager.webapp.TestRMWebServicesApps.testAppStatistics

Error Message:
null

Stack Trace:
java.lang.NullPointerException: null
	at javax.security.auth.Subject$ClassSet.populateSet(Subject.java:1391)
	at javax.security.auth.Subject$ClassSet.<init>(Subject.java:1353)
	at javax.security.auth.Subject.getPublicCredentials(Subject.java:720)
	at org.apache.hadoop.security.UserGroupInformation.getTokenIdentifiers(UserGroupInformation.java:1439)
	at org.apache.hadoop.yarn.server.utils.YarnServerSecurityUtils.selectAMRMTokenIdentifier(YarnServerSecurityUtils.java:104)
	at org.apache.hadoop.yarn.server.utils.YarnServerSecurityUtils.authorizeRequest(YarnServerSecurityUtils.java:76)
	at org.apache.hadoop.yarn.server.resourcemanager.ApplicationMasterService.registerApplicationMaster(ApplicationMasterService.java:182)
	at org.apache.hadoop.yarn.server.resourcemanager.MockAM$1.run(MockAM.java:134)
	at org.apache.hadoop.yarn.server.resourcemanager.MockAM$1.run(MockAM.java:131)
	at java.security.AccessController.doPrivileged(Native Method)
	at javax.security.auth.Subject.doAs(Subject.java:422)
	at org.apache.hadoop.security.UserGroupInformation.doAs(UserGroupInformation.java:1669)
	at org.apache.hadoop.yarn.server.resourcemanager.MockAM.registerAppAttempt(MockAM.java:130)
	at org.apache.hadoop.yarn.server.resourcemanager.MockAM.registerAppAttempt(MockAM.java:106)
	at org.apache.hadoop.yarn.server.resourcemanager.webapp.TestRMWebServicesApps.testAppStatistics(TestRMWebServicesApps.java:989)


FAILED:  org.apache.hadoop.yarn.server.resourcemanager.webapp.TestRMWebServicesApps.testMultipleAppAttempts

Error Message:
null

Stack Trace:
java.lang.NullPointerException: null
	at javax.security.auth.Subject$ClassSet.populateSet(Subject.java:1391)
	at javax.security.auth.Subject$ClassSet.<init>(Subject.java:1353)
	at javax.security.auth.Subject.getPublicCredentials(Subject.java:720)
	at org.apache.hadoop.security.UserGroupInformation.getTokenIdentifiers(UserGroupInformation.java:1439)
	at org.apache.hadoop.yarn.server.utils.YarnServerSecurityUtils.selectAMRMTokenIdentifier(YarnServerSecurityUtils.java:104)
	at org.apache.hadoop.yarn.server.utils.YarnServerSecurityUtils.authorizeRequest(YarnServerSecurityUtils.java:76)
	at org.apache.hadoop.yarn.server.resourcemanager.ApplicationMasterService.registerApplicationMaster(ApplicationMasterService.java:182)
	at org.apache.hadoop.yarn.server.resourcemanager.MockAM$1.run(MockAM.java:134)
	at org.apache.hadoop.yarn.server.resourcemanager.MockAM$1.run(MockAM.java:131)
	at java.security.AccessController.doPrivileged(Native Method)
	at javax.security.auth.Subject.doAs(Subject.java:422)
	at org.apache.hadoop.security.UserGroupInformation.doAs(UserGroupInformation.java:1669)
	at org.apache.hadoop.yarn.server.resourcemanager.MockAM.registerAppAttempt(MockAM.java:130)
	at org.apache.hadoop.yarn.server.resourcemanager.MockAM.registerAppAttempt(MockAM.java:106)
	at org.apache.hadoop.yarn.server.resourcemanager.MockRM.launchAndRegisterAM(MockRM.java:837)
	at org.apache.hadoop.yarn.server.resourcemanager.webapp.TestRMWebServicesApps.testMultipleAppAttempts(TestRMWebServicesApps.java:1452)


FAILED:  org.apache.hadoop.yarn.server.resourcemanager.webapp.TestRMWebServicesApps.testAppsQueryFinishEnd

Error Message:
null

Stack Trace:
java.lang.NullPointerException: null
	at javax.security.auth.Subject$ClassSet.populateSet(Subject.java:1391)
	at javax.security.auth.Subject$ClassSet.<init>(Subject.java:1353)
	at javax.security.auth.Subject.getPublicCredentials(Subject.java:720)
	at org.apache.hadoop.security.UserGroupInformation.getTokenIdentifiers(UserGroupInformation.java:1439)
	at org.apache.hadoop.yarn.server.utils.YarnServerSecurityUtils.selectAMRMTokenIdentifier(YarnServerSecurityUtils.java:104)
	at org.apache.hadoop.yarn.server.utils.YarnServerSecurityUtils.authorizeRequest(YarnServerSecurityUtils.java:76)
	at org.apache.hadoop.yarn.server.resourcemanager.ApplicationMasterService.registerApplicationMaster(ApplicationMasterService.java:182)
	at org.apache.hadoop.yarn.server.resourcemanager.MockAM$1.run(MockAM.java:134)
	at org.apache.hadoop.yarn.server.resourcemanager.MockAM$1.run(MockAM.java:131)
	at java.security.AccessController.doPrivileged(Native Method)
	at javax.security.auth.Subject.doAs(Subject.java:422)
	at org.apache.hadoop.security.UserGroupInformation.doAs(UserGroupInformation.java:1669)
	at org.apache.hadoop.yarn.server.resourcemanager.MockAM.registerAppAttempt(MockAM.java:130)
	at org.apache.hadoop.yarn.server.resourcemanager.MockAM.registerAppAttempt(MockAM.java:106)
	at org.apache.hadoop.yarn.server.resourcemanager.webapp.TestRMWebServicesApps.testAppsQueryFinishEnd(TestRMWebServicesApps.java:734)


FAILED:  org.apache.hadoop.yarn.server.resourcemanager.webapp.TestRMWebServicesApps.testAppsQueryAppTypes

Error Message:
null

Stack Trace:
java.lang.NullPointerException: null
	at javax.security.auth.Subject$ClassSet.populateSet(Subject.java:1391)
	at javax.security.auth.Subject$ClassSet.<init>(Subject.java:1353)
	at javax.security.auth.Subject.getPublicCredentials(Subject.java:720)
	at org.apache.hadoop.security.UserGroupInformation.getTokenIdentifiers(UserGroupInformation.java:1439)
	at org.apache.hadoop.yarn.server.utils.YarnServerSecurityUtils.selectAMRMTokenIdentifier(YarnServerSecurityUtils.java:104)
	at org.apache.hadoop.yarn.server.utils.YarnServerSecurityUtils.authorizeRequest(YarnServerSecurityUtils.java:76)
	at org.apache.hadoop.yarn.server.resourcemanager.ApplicationMasterService.registerApplicationMaster(ApplicationMasterService.java:182)
	at org.apache.hadoop.yarn.server.resourcemanager.MockAM$1.run(MockAM.java:134)
	at org.apache.hadoop.yarn.server.resourcemanager.MockAM$1.run(MockAM.java:131)
	at java.security.AccessController.doPrivileged(Native Method)
	at javax.security.auth.Subject.doAs(Subject.java:422)
	at org.apache.hadoop.security.UserGroupInformation.doAs(UserGroupInformation.java:1669)
	at org.apache.hadoop.yarn.server.resourcemanager.MockAM.registerAppAttempt(MockAM.java:130)
	at org.apache.hadoop.yarn.server.resourcemanager.MockAM.registerAppAttempt(MockAM.java:106)
	at org.apache.hadoop.yarn.server.resourcemanager.webapp.TestRMWebServicesApps.testAppsQueryAppTypes(TestRMWebServicesApps.java:802)


FAILED:  org.apache.hadoop.yarn.server.resourcemanager.webapp.TestRMWebServicesApps.testAppsQueryFinishBeginEnd

Error Message:
null

Stack Trace:
java.lang.NullPointerException: null
	at javax.security.auth.Subject$ClassSet.populateSet(Subject.java:1391)
	at javax.security.auth.Subject$ClassSet.<init>(Subject.java:1353)
	at javax.security.auth.Subject.getPublicCredentials(Subject.java:720)
	at org.apache.hadoop.security.UserGroupInformation.getTokenIdentifiers(UserGroupInformation.java:1439)
	at org.apache.hadoop.yarn.server.utils.YarnServerSecurityUtils.selectAMRMTokenIdentifier(YarnServerSecurityUtils.java:104)
	at org.apache.hadoop.yarn.server.utils.YarnServerSecurityUtils.authorizeRequest(YarnServerSecurityUtils.java:76)
	at org.apache.hadoop.yarn.server.resourcemanager.ApplicationMasterService.registerApplicationMaster(ApplicationMasterService.java:182)
	at org.apache.hadoop.yarn.server.resourcemanager.MockAM$1.run(MockAM.java:134)
	at org.apache.hadoop.yarn.server.resourcemanager.MockAM$1.run(MockAM.java:131)
	at java.security.AccessController.doPrivileged(Native Method)
	at javax.security.auth.Subject.doAs(Subject.java:422)
	at org.apache.hadoop.security.UserGroupInformation.doAs(UserGroupInformation.java:1669)
	at org.apache.hadoop.yarn.server.resourcemanager.MockAM.registerAppAttempt(MockAM.java:130)
	at org.apache.hadoop.yarn.server.resourcemanager.MockAM.registerAppAttempt(MockAM.java:106)
	at org.apache.hadoop.yarn.server.resourcemanager.webapp.TestRMWebServicesApps.testAppsQueryFinishBeginEnd(TestRMWebServicesApps.java:768)


FAILED:  org.apache.hadoop.yarn.server.resourcemanager.webapp.TestRMWebappAuthentication.org.apache.hadoop.yarn.server.resourcemanager.webapp.TestRMWebappAuthentication

Error Message:
org/apache/hadoop/security/UserGroupInformation

Stack Trace:
java.lang.NoClassDefFoundError: org/apache/hadoop/security/UserGroupInformation
	at java.net.URLClassLoader$1.run(URLClassLoader.java:372)
	at java.net.URLClassLoader$1.run(URLClassLoader.java:361)
	at java.security.AccessController.doPrivileged(Native Method)
	at java.net.URLClassLoader.findClass(URLClassLoader.java:360)
	at java.lang.ClassLoader.loadClass(ClassLoader.java:424)
	at sun.misc.Launcher$AppClassLoader.loadClass(Launcher.java:308)
	at java.lang.ClassLoader.loadClass(ClassLoader.java:357)
	at org.apache.hadoop.yarn.server.resourcemanager.webapp.TestRMWebappAuthentication.setupKDC(TestRMWebappAuthentication.java:127)
	at org.apache.hadoop.yarn.server.resourcemanager.webapp.TestRMWebappAuthentication.setUp(TestRMWebappAuthentication.java:110)



Mime
  • Unnamed multipart/mixed (inline, None, 0 bytes)
View raw message