hadoop-yarn-dev mailing list archives

Site index · List index
Message view « Date » · « Thread »
Top « Date » · « Thread »
From Apache Jenkins Server <jenk...@builds.apache.org>
Subject Hadoop-Yarn-trunk - Build # 1348 - Still Failing
Date Mon, 02 Nov 2015 01:18:20 GMT
See https://builds.apache.org/job/Hadoop-Yarn-trunk/1348/

###################################################################################
########################## LAST 60 LINES OF THE CONSOLE ###########################
[...truncated 9504 lines...]

Tests in error: 
  TestWorkPreservingRMRestart.testReleasedContainerNotRecovered:1099 NoClassDefFound
  TestWorkPreservingRMRestart.testAppFailedToRenewTokenOnRecovery:1264 » NoClassDefFound
  TestWorkPreservingRMRestart.testDynamicQueueRecovery:304->getSchedulerDynamicConfiguration:268
» NoClassDefFound
  TestWorkPreservingRMRestart.testReleasedContainerNotRecovered:1099 NoClassDefFound
  TestWorkPreservingRMRestart.testAppFailedToRenewTokenOnRecovery:1264 » NoClassDefFound
  TestWorkPreservingRMRestart.testDynamicQueueRecovery:304->getSchedulerDynamicConfiguration:268
» NoClassDefFound

Tests run: 1253, Failures: 0, Errors: 6, Skipped: 1

[INFO] ------------------------------------------------------------------------
[INFO] Reactor Summary:
[INFO] 
[INFO] Apache Hadoop YARN ................................ SUCCESS [  3.959 s]
[INFO] Apache Hadoop YARN API ............................ SUCCESS [04:07 min]
[INFO] Apache Hadoop YARN Common ......................... SUCCESS [02:58 min]
[INFO] Apache Hadoop YARN Server ......................... SUCCESS [  0.090 s]
[INFO] Apache Hadoop YARN Server Common .................. SUCCESS [ 45.834 s]
[INFO] Apache Hadoop YARN NodeManager .................... SUCCESS [09:18 min]
[INFO] Apache Hadoop YARN Web Proxy ...................... SUCCESS [ 25.020 s]
[INFO] Apache Hadoop YARN ApplicationHistoryService ...... SUCCESS [03:23 min]
[INFO] Apache Hadoop YARN ResourceManager ................ FAILURE [58:48 min]
[INFO] Apache Hadoop YARN Server Tests ................... SKIPPED
[INFO] Apache Hadoop YARN Client ......................... SKIPPED
[INFO] Apache Hadoop YARN SharedCacheManager ............. SKIPPED
[INFO] Apache Hadoop YARN Applications ................... SKIPPED
[INFO] Apache Hadoop YARN DistributedShell ............... SKIPPED
[INFO] Apache Hadoop YARN Unmanaged Am Launcher .......... SKIPPED
[INFO] Apache Hadoop YARN Site ........................... SKIPPED
[INFO] Apache Hadoop YARN Registry ....................... SKIPPED
[INFO] Apache Hadoop YARN Project ........................ SKIPPED
[INFO] ------------------------------------------------------------------------
[INFO] BUILD FAILURE
[INFO] ------------------------------------------------------------------------
[INFO] Total time: 01:19 h
[INFO] Finished at: 2015-11-02T01:18:16+00:00
[INFO] Final Memory: 62M/512M
[INFO] ------------------------------------------------------------------------
[ERROR] Failed to execute goal org.apache.maven.plugins:maven-surefire-plugin:2.17:test (default-test)
on project hadoop-yarn-server-resourcemanager: There are test failures.
[ERROR] 
[ERROR] Please refer to /home/jenkins/jenkins-slave/workspace/Hadoop-Yarn-trunk/hadoop-yarn-project/hadoop-yarn/hadoop-yarn-server/hadoop-yarn-server-resourcemanager/target/surefire-reports
for the individual test results.
[ERROR] -> [Help 1]
[ERROR] 
[ERROR] To see the full stack trace of the errors, re-run Maven with the -e switch.
[ERROR] Re-run Maven using the -X switch to enable full debug logging.
[ERROR] 
[ERROR] For more information about the errors and possible solutions, please read the following
articles:
[ERROR] [Help 1] http://cwiki.apache.org/confluence/display/MAVEN/MojoFailureException
[ERROR] 
[ERROR] After correcting the problems, you can resume the build with the command
[ERROR]   mvn <goals> -rf :hadoop-yarn-server-resourcemanager
Build step 'Execute shell' marked build as failure
Archiving artifacts
Recording test results
Updating HDFS-9343
Sending e-mails to: yarn-dev@hadoop.apache.org
Email was triggered for: Failure - Any
Sending email for trigger: Failure - Any



###################################################################################
############################## FAILED TESTS (if any) ##############################
6 tests failed.
FAILED:  org.apache.hadoop.yarn.server.resourcemanager.TestWorkPreservingRMRestart.testReleasedContainerNotRecovered[0]

Error Message:
org/apache/hadoop/test/GenericTestUtils

Stack Trace:
java.lang.NoClassDefFoundError: org/apache/hadoop/test/GenericTestUtils
	at java.net.URLClassLoader$1.run(URLClassLoader.java:366)
	at java.net.URLClassLoader$1.run(URLClassLoader.java:355)
	at java.security.AccessController.doPrivileged(Native Method)
	at java.net.URLClassLoader.findClass(URLClassLoader.java:354)
	at java.lang.ClassLoader.loadClass(ClassLoader.java:425)
	at sun.misc.Launcher$AppClassLoader.loadClass(Launcher.java:308)
	at java.lang.ClassLoader.loadClass(ClassLoader.java:358)
	at org.apache.hadoop.yarn.server.resourcemanager.TestWorkPreservingRMRestart.testReleasedContainerNotRecovered(TestWorkPreservingRMRestart.java:1099)


FAILED:  org.apache.hadoop.yarn.server.resourcemanager.TestWorkPreservingRMRestart.testAppFailedToRenewTokenOnRecovery[0]

Error Message:
org/apache/hadoop/io/FastByteComparisons

Stack Trace:
java.lang.NoClassDefFoundError: org/apache/hadoop/io/FastByteComparisons
	at java.net.URLClassLoader$1.run(URLClassLoader.java:366)
	at java.net.URLClassLoader$1.run(URLClassLoader.java:355)
	at java.security.AccessController.doPrivileged(Native Method)
	at java.net.URLClassLoader.findClass(URLClassLoader.java:354)
	at java.lang.ClassLoader.loadClass(ClassLoader.java:425)
	at sun.misc.Launcher$AppClassLoader.loadClass(Launcher.java:308)
	at java.lang.ClassLoader.loadClass(ClassLoader.java:358)
	at org.apache.hadoop.io.WritableComparator.compareBytes(WritableComparator.java:188)
	at org.apache.hadoop.io.BinaryComparable.compareTo(BinaryComparable.java:50)
	at org.apache.hadoop.io.BinaryComparable.equals(BinaryComparable.java:72)
	at org.apache.hadoop.io.Text.equals(Text.java:348)
	at java.util.HashMap.getEntry(HashMap.java:471)
	at java.util.HashMap.get(HashMap.java:421)
	at org.apache.hadoop.security.Credentials.getSecretKey(Credentials.java:120)
	at org.apache.hadoop.yarn.server.resourcemanager.rmapp.attempt.RMAppAttemptImpl.recoverAppAttemptCredentials(RMAppAttemptImpl.java:916)
	at org.apache.hadoop.yarn.server.resourcemanager.rmapp.attempt.RMAppAttemptImpl.recover(RMAppAttemptImpl.java:891)
	at org.apache.hadoop.yarn.server.resourcemanager.rmapp.RMAppImpl.recover(RMAppImpl.java:813)
	at org.apache.hadoop.yarn.server.resourcemanager.rmapp.RMAppImpl$RMAppRecoveredTransition.transition(RMAppImpl.java:940)
	at org.apache.hadoop.yarn.server.resourcemanager.rmapp.RMAppImpl$RMAppRecoveredTransition.transition(RMAppImpl.java:933)
	at org.apache.hadoop.yarn.state.StateMachineFactory$MultipleInternalArc.doTransition(StateMachineFactory.java:385)
	at org.apache.hadoop.yarn.state.StateMachineFactory.doTransition(StateMachineFactory.java:302)
	at org.apache.hadoop.yarn.state.StateMachineFactory.access$300(StateMachineFactory.java:46)
	at org.apache.hadoop.yarn.state.StateMachineFactory$InternalStateMachine.doTransition(StateMachineFactory.java:448)
	at org.apache.hadoop.yarn.server.resourcemanager.rmapp.RMAppImpl.handle(RMAppImpl.java:782)
	at org.apache.hadoop.yarn.server.resourcemanager.RMAppManager.recoverApplication(RMAppManager.java:323)
	at org.apache.hadoop.yarn.server.resourcemanager.RMAppManager.recover(RMAppManager.java:442)
	at org.apache.hadoop.yarn.server.resourcemanager.ResourceManager.recover(ResourceManager.java:1200)
	at org.apache.hadoop.yarn.server.resourcemanager.ResourceManager$RMActiveServices.serviceStart(ResourceManager.java:587)
	at org.apache.hadoop.service.AbstractService.start(AbstractService.java:193)
	at org.apache.hadoop.yarn.server.resourcemanager.ResourceManager.startActiveServices(ResourceManager.java:989)
	at org.apache.hadoop.yarn.server.resourcemanager.ResourceManager$1.run(ResourceManager.java:1030)
	at org.apache.hadoop.yarn.server.resourcemanager.ResourceManager$1.run(ResourceManager.java:1026)
	at java.security.AccessController.doPrivileged(Native Method)
	at javax.security.auth.Subject.doAs(Subject.java:415)
	at org.apache.hadoop.security.UserGroupInformation.doAs(UserGroupInformation.java:1669)
	at org.apache.hadoop.yarn.server.resourcemanager.ResourceManager.transitionToActive(ResourceManager.java:1026)
	at org.apache.hadoop.yarn.server.resourcemanager.ResourceManager.serviceStart(ResourceManager.java:1066)
	at org.apache.hadoop.service.AbstractService.start(AbstractService.java:193)
	at org.apache.hadoop.yarn.server.resourcemanager.TestWorkPreservingRMRestart.testAppFailedToRenewTokenOnRecovery(TestWorkPreservingRMRestart.java:1264)


FAILED:  org.apache.hadoop.yarn.server.resourcemanager.TestWorkPreservingRMRestart.testDynamicQueueRecovery[0]

Error Message:
org/apache/hadoop/conf/Configuration$ParsedTimeDuration

Stack Trace:
java.lang.NoClassDefFoundError: org/apache/hadoop/conf/Configuration$ParsedTimeDuration
	at java.net.URLClassLoader$1.run(URLClassLoader.java:366)
	at java.net.URLClassLoader$1.run(URLClassLoader.java:355)
	at java.security.AccessController.doPrivileged(Native Method)
	at java.net.URLClassLoader.findClass(URLClassLoader.java:354)
	at java.lang.ClassLoader.loadClass(ClassLoader.java:425)
	at sun.misc.Launcher$AppClassLoader.loadClass(Launcher.java:308)
	at java.lang.ClassLoader.loadClass(ClassLoader.java:358)
	at org.apache.hadoop.conf.Configuration.setTimeDuration(Configuration.java:1610)
	at org.apache.hadoop.yarn.server.resourcemanager.TestWorkPreservingRMRestart.getSchedulerDynamicConfiguration(TestWorkPreservingRMRestart.java:268)
	at org.apache.hadoop.yarn.server.resourcemanager.TestWorkPreservingRMRestart.testDynamicQueueRecovery(TestWorkPreservingRMRestart.java:304)


FAILED:  org.apache.hadoop.yarn.server.resourcemanager.TestWorkPreservingRMRestart.testReleasedContainerNotRecovered[1]

Error Message:
org/apache/hadoop/test/GenericTestUtils

Stack Trace:
java.lang.NoClassDefFoundError: org/apache/hadoop/test/GenericTestUtils
	at org.apache.hadoop.yarn.server.resourcemanager.TestWorkPreservingRMRestart.testReleasedContainerNotRecovered(TestWorkPreservingRMRestart.java:1099)


FAILED:  org.apache.hadoop.yarn.server.resourcemanager.TestWorkPreservingRMRestart.testAppFailedToRenewTokenOnRecovery[1]

Error Message:
org/apache/hadoop/io/FastByteComparisons

Stack Trace:
java.lang.NoClassDefFoundError: org/apache/hadoop/io/FastByteComparisons
	at org.apache.hadoop.io.WritableComparator.compareBytes(WritableComparator.java:188)
	at org.apache.hadoop.io.BinaryComparable.compareTo(BinaryComparable.java:50)
	at org.apache.hadoop.io.BinaryComparable.equals(BinaryComparable.java:72)
	at org.apache.hadoop.io.Text.equals(Text.java:348)
	at java.util.HashMap.getEntry(HashMap.java:471)
	at java.util.HashMap.get(HashMap.java:421)
	at org.apache.hadoop.security.Credentials.getSecretKey(Credentials.java:120)
	at org.apache.hadoop.yarn.server.resourcemanager.rmapp.attempt.RMAppAttemptImpl.recoverAppAttemptCredentials(RMAppAttemptImpl.java:916)
	at org.apache.hadoop.yarn.server.resourcemanager.rmapp.attempt.RMAppAttemptImpl.recover(RMAppAttemptImpl.java:891)
	at org.apache.hadoop.yarn.server.resourcemanager.rmapp.RMAppImpl.recover(RMAppImpl.java:813)
	at org.apache.hadoop.yarn.server.resourcemanager.rmapp.RMAppImpl$RMAppRecoveredTransition.transition(RMAppImpl.java:940)
	at org.apache.hadoop.yarn.server.resourcemanager.rmapp.RMAppImpl$RMAppRecoveredTransition.transition(RMAppImpl.java:933)
	at org.apache.hadoop.yarn.state.StateMachineFactory$MultipleInternalArc.doTransition(StateMachineFactory.java:385)
	at org.apache.hadoop.yarn.state.StateMachineFactory.doTransition(StateMachineFactory.java:302)
	at org.apache.hadoop.yarn.state.StateMachineFactory.access$300(StateMachineFactory.java:46)
	at org.apache.hadoop.yarn.state.StateMachineFactory$InternalStateMachine.doTransition(StateMachineFactory.java:448)
	at org.apache.hadoop.yarn.server.resourcemanager.rmapp.RMAppImpl.handle(RMAppImpl.java:782)
	at org.apache.hadoop.yarn.server.resourcemanager.RMAppManager.recoverApplication(RMAppManager.java:323)
	at org.apache.hadoop.yarn.server.resourcemanager.RMAppManager.recover(RMAppManager.java:442)
	at org.apache.hadoop.yarn.server.resourcemanager.ResourceManager.recover(ResourceManager.java:1200)
	at org.apache.hadoop.yarn.server.resourcemanager.ResourceManager$RMActiveServices.serviceStart(ResourceManager.java:587)
	at org.apache.hadoop.service.AbstractService.start(AbstractService.java:193)
	at org.apache.hadoop.yarn.server.resourcemanager.ResourceManager.startActiveServices(ResourceManager.java:989)
	at org.apache.hadoop.yarn.server.resourcemanager.ResourceManager$1.run(ResourceManager.java:1030)
	at org.apache.hadoop.yarn.server.resourcemanager.ResourceManager$1.run(ResourceManager.java:1026)
	at java.security.AccessController.doPrivileged(Native Method)
	at javax.security.auth.Subject.doAs(Subject.java:415)
	at org.apache.hadoop.security.UserGroupInformation.doAs(UserGroupInformation.java:1669)
	at org.apache.hadoop.yarn.server.resourcemanager.ResourceManager.transitionToActive(ResourceManager.java:1026)
	at org.apache.hadoop.yarn.server.resourcemanager.ResourceManager.serviceStart(ResourceManager.java:1066)
	at org.apache.hadoop.service.AbstractService.start(AbstractService.java:193)
	at org.apache.hadoop.yarn.server.resourcemanager.TestWorkPreservingRMRestart.testAppFailedToRenewTokenOnRecovery(TestWorkPreservingRMRestart.java:1264)


FAILED:  org.apache.hadoop.yarn.server.resourcemanager.TestWorkPreservingRMRestart.testDynamicQueueRecovery[1]

Error Message:
org/apache/hadoop/conf/Configuration$ParsedTimeDuration

Stack Trace:
java.lang.NoClassDefFoundError: org/apache/hadoop/conf/Configuration$ParsedTimeDuration
	at org.apache.hadoop.conf.Configuration.setTimeDuration(Configuration.java:1610)
	at org.apache.hadoop.yarn.server.resourcemanager.TestWorkPreservingRMRestart.getSchedulerDynamicConfiguration(TestWorkPreservingRMRestart.java:268)
	at org.apache.hadoop.yarn.server.resourcemanager.TestWorkPreservingRMRestart.testDynamicQueueRecovery(TestWorkPreservingRMRestart.java:304)



Mime
  • Unnamed multipart/mixed (inline, None, 0 bytes)
View raw message